Phenol, 2-ethyl-4,5-dimethyl-
- Formula: C10H14O
- Molecular weight: 150.2176
- IUPAC Standard InChIKey: ZUDAICPAUJSPHK-UHFFFAOYSA-N
- CAS Registry Number: 2219-78-5
- Chemical structure:
View 3d structure (requires JavaScript / HTML 5) - Other names: 3,4-Xylenol, 6-ethyl-; 6-Ethyl-3,4-dimethylphenol; 1-Hydroxy-3,4-dimethyl-6-ethylbenzene; 4,5-Dimethyl-2-ethylphenol; 2-ethyl-4,5-dimethylphenol

Phase change data

Data compiled by: Thermodynamics Research Center, NIST Boulder Laboratories, Chris Muzny director
Quantity | Value | Units | Method | Reference | Comment |
---|---|---|---|---|---|
Tboil | 523.15 | K | N/A | Karr, Estep, et al., 1961 | Uncertainty assigned by TRC = 5. K |
Quantity | Value | Units | Method | Reference | Comment |
Tfus | 324.65 | K | N/A | Karr, 1957 | Uncertainty assigned by TRC = 2. K |
Tfus | 324.65 | K | N/A | Von Auwers, Bundesmann, et al., 1926 | Uncertainty assigned by TRC = 2. K |

References

Karr, Estep, et al., 1961
Karr, C.; Estep, P.A.; Chang, T.-C.L.; Comberiati, H.R.,
, U. S. Bur. Mines, Bull. 591, 1961. [all data]
Karr, 1957
Karr, C.,
, U. S. Bur. Mines, Inform. Circ. IC 7802, 1957. [all data]
Von Auwers, Bundesmann, et al., 1926
Von Auwers, K.; Bundesmann, H.; Wieners, F.,
Justus Liebigs Ann. Chem., 1926, 447, 162. [all data]