Phenol, 4-ethyl-2-methyl-
- Formula: C9H12O
- Molecular weight: 136.1910
- IUPAC Standard InChIKey: QDQMEHXIUFCIGR-UHFFFAOYSA-N
- CAS Registry Number: 2219-73-0
- Chemical structure:
View 3d structure (requires JavaScript / HTML 5) - Other names: o-Cresol, 4-ethyl-; 2-Methyl-4-ethylphenol; 4-Ethyl-o-cresol; 4-Ethyl-2-methylphenol

Phase change data

Data compiled by: Thermodynamics Research Center, NIST Boulder Laboratories, Chris Muzny director
Quantity | Value | Units | Method | Reference | Comment |
---|---|---|---|---|---|
Tboil | 498. ± 5. | K | AVG | N/A | Average of 9 values; Individual data points |

Kovats' RI, non-polar column, isothermal

View large format table.

Column type Active phase Temperature (C) I Reference Comment
CapillaryOV-1150.1253.Zhang, Chen, et al., 199725. m/0.2 mm/0.33 μm, N2

Normal alkane RI, polar column, custom temperature program

View large format table.

Column type Active phase I Reference Comment
CapillaryCarbowax 20M2192.Zimmermann, Lauterbach, et al., 1985Program: not specified

References

No reference data available.