Barbituric acid, 5,5-dipropyl-
- Formula: C10H16N2O3
- Molecular weight: 212.2456
- IUPAC Standard InChIKey: RCOUWKSZRXJXLA-UHFFFAOYSA-N
- CAS Registry Number: 2217-08-5
- Chemical structure:
View 3d structure (requires JavaScript / HTML 5) - Other names: di-n-Propylbarbituric acid; 2,4,6(1H,3H,5H)-Pyrimidinetrione, 5,5-dipropyl-; Dipropylbarbituric acid; 5,5-Dipropylbarbituric acid; Proponal; Propylbarbital; Dipropylbarbital; 5,5-Dipropyl-2,4,6(1H,3H,5H)-pyrimidinetrione

Kovats' RI, non-polar column, temperature ramp

Column type | Active phase | I | Reference | Comment |
---|---|---|---|---|
Packed | SE-30 | 1650. | Maurer, 1990 | N2, 100. C @ 3. min, 30. K/min, 310. C @ 5. min |

References

Maurer, 1990
Maurer, H.H.,
Identification and differentiation of barbiturates, other sedative-hypnotics and their metabolites in urine integrated in a general screening procedure using computerized gas chromatography-mass spectrometry,
J. Chromatogr., 1990, 530, 307-326, https://doi.org/10.1016/S0378-4347(00)82334-8
. [all data]