Furaldehyde phenylhydrazone
- Formula: C11H10N2O
- Molecular weight: 186.2099
- IUPAC Standard InChIKey: GGOUAWDZZIQPLT-UHFFFAOYSA-N
- CAS Registry Number: 2216-75-3
- Chemical structure:
View 3d structure (requires JavaScript / HTML 5) - Other names: Furfural phenylhydrazone; 2-Furaldehyde, phenylhydrazone; 2-Furancarboxaldehyde, phenylhydrazone; N-Phenyl-N'-furaldehyde hydrazone

Condensed phase thermochemistry data

Data compiled by: Hussein Y. Afeefy, Joel F. Liebman, and Stephen E. Stein
Quantity | Value | Units | Method | Reference | Comment |
---|---|---|---|---|---|
ΔfH°solid | -116.5 | kJ/mol | Ccb | Landrieu, 1905 | Author's hf298_condensed[kcal/mol]=-34.0 kcal/mol |
ΔfH°solid | -151. | kJ/mol | Cm | Landrieu, 1905 | |
Quantity | Value | Units | Method | Reference | Comment |
ΔcH°solid | -5641.3 | kJ/mol | Ccb | Landrieu, 1905 | Author's hf298_condensed[kcal/mol]=-34.0 kcal/mol |

Reaction thermochemistry data

Data compiled by: Hussein Y. Afeefy, Joel F. Liebman, and Stephen E. Stein
Individual Reactions
By formula: C11H10N2O + H2O = C6H8N2 + C5H4O2
Quantity | Value | Units | Method | Reference | Comment |
---|---|---|---|---|---|
ΔrH° | -61.9 | kJ/mol | Cm | Landrieu, 1905 | solid phase |

References

Landrieu, 1905
Landrieu, M.Ph.,
Thermochimie. - Thermochimie des hydrazones,
Compt. Rend., 1905, 141, 358-361. [all data]