p-Methylbenzyl acetate
- Formula: C10H12O2
- Molecular weight: 164.2011
- IUPAC Standard InChIKey: WDCUPFMSLUIQBH-UHFFFAOYSA-N
- CAS Registry Number: 2216-45-7
- Chemical structure:
View 3d structure (requires JavaScript / HTML 5) - Other names: 4-Methylbenzyl acetate; Benzenemethanol, 4-methyl-, acetate; p-Tolubenzyl acetate; p-Xylene, α-acetoxy; p-Xylyl acetate; Benzyl alcohol, p-methyl-, acetate; 4-Methylbenzyl ethanoate; Benzenemethanol, 4-methyl-, 1-acetate; NSC 7001; p-Acetoxymethyltoluene; Acetic acid, (4-methylphenyl)methyl ester

Van Den Dool and Kratz RI, non-polar column, temperature ramp

Column type | Active phase | I | Reference | Comment |
---|---|---|---|---|
Capillary | 5 % Phenyl methyl siloxane | 1290. | Zaikin, 2010 | 30. m/0.25 mm/0.25 μm, 15. K/min, 270. C @ 15. min; Tstart: 60. C |

References

Zaikin, 2010
Zaikin, V.G.,
Personal communication: Retention indices measured during 2010, 2010. [all data]