2-Nonene
- Formula: C9H18
- Molecular weight: 126.2392
- IUPAC Standard InChIKey: IICQZTQZQSBHBY-UHFFFAOYSA-N
- CAS Registry Number: 2216-38-8
- Chemical structure:
View 3d structure (requires JavaScript / HTML 5) - Stereoisomers:

Phase change data

Data compiled by: Thermodynamics Research Center, NIST Boulder Laboratories, Chris Muzny director
Quantity | Value | Units | Method | Reference | Comment |
---|---|---|---|---|---|
Tboil | 423.03 | K | N/A | Spengler, 1948 | Uncertainty assigned by TRC = 0.4 K |
Tboil | 422.5 | K | N/A | Gibson, 1938 | Uncertainty assigned by TRC = 1.5 K |
Tboil | 421.7 | K | N/A | Bourguel, 1927 | Uncertainty assigned by TRC = 2. K |
Quantity | Value | Units | Method | Reference | Comment |
Tfus | 181. | K | N/A | Spengler, 1948 | Uncertainty assigned by TRC = 2. K |

Normal alkane RI, non-polar column, temperature ramp

Column type | Active phase | I | Reference | Comment |
---|---|---|---|---|
Capillary | DB-1 | 909. | Sonboli, Kanani, et al., 2007 | 60. m/0.25 mm/0.25 μm, Nitrogen, 5. K/min, 250. C @ 10. min; Tstart: 60. C |
Capillary | SE-30 | 902. | Zhou, Robards, et al., 2000 | 10. K/min, 300. C @ 4. min; Column length: 30. m; Column diameter: 0.25 mm; Tstart: 50. C |

References

Spengler, 1948
Spengler, G.,
Unpublished, Inst. Kohleforschung, Prague, Czechosl- ovakia (transmitted by L. L. Newman, U. S, 1948. [all data]
Gibson, 1938
Gibson, J.D.,
Olefins of Types I and II from Butadiene and the Relation of Their Physical Constants to Structure, Ph.D. Thesis, Ohio State Univ., Columbus, OH, 1938. [all data]
Bourguel, 1927
Bourguel, M.,
Bull. Soc. Chim. Fr., 1927, 41, 1475. [all data]
Sonboli, Kanani, et al., 2007
Sonboli, A.; Kanani, M.R.; Yousefzadi, M.; Mojarrad, M.,
Biological activity and composition of the essential oil of Tetrataenium nephrophyllum (Apiaceae) from Iran,
Natural Product Communications, 2007, 2, 12, 1249-1252. [all data]
Zhou, Robards, et al., 2000
Zhou, M.; Robards, K.; Glennie-Holmes, M.; Helliwell, S.,
Contribution of volatiles to the flavour of oatmeal,
J. Sci. Food Agric., 2000, 80, 2, 247-254, https://doi.org/10.1002/(SICI)1097-0010(20000115)80:2<247::AID-JSFA525>3.0.CO;2-0
. [all data]