Octane, 4-methyl-
- Formula: C9H20
- Molecular weight: 128.2551
- IUPAC Standard InChIKey: DOGIHOCMZJUJNR-UHFFFAOYSA-N
- CAS Registry Number: 2216-34-4
- Chemical structure:
View 3d structure (requires JavaScript / HTML 5) - Species with the same structure:
- Other names: 4-Methyloctane; 1,3-Dimethylheptane

Phase change data

Data compiled as indicated in comments:
TRC - Thermodynamics Research Center, NIST Boulder Laboratories, Chris Muzny director
AC - William E. Acree, Jr., James S. Chickos
Quantity | Value | Units | Method | Reference | Comment |
---|---|---|---|---|---|
Tboil | 415. ± 1. | K | AVG | N/A | Average of 16 values; Individual data points |
Quantity | Value | Units | Method | Reference | Comment |
Tfus | 219.62 | K | N/A | Pomerantz, Fookson, et al., 1954 | Uncertainty assigned by TRC = 0.2 K; This value was reported, but seems much too high in comparison to the melting point of n-nonane; TRC |
Tfus | 159.95 | K | N/A | Slabey and Wise, 1952 | Uncertainty assigned by TRC = 0.5 K; TRC |
Tfus | 154.02 | K | N/A | White and Glasgow, 1937 | Uncertainty assigned by TRC = 0.15 K; TRC |
Tfus | 159.85 | K | N/A | White and Glasgow, 1937 | Uncertainty assigned by TRC = 0.15 K; TRC |
Quantity | Value | Units | Method | Reference | Comment |
ΔvapH° | 44.5 | kJ/mol | N/A | Reid, 1972 | See also Labbauf, Greenshields, et al., 1961.; AC |

Henry's Law data

Data compiled by: Rolf Sander
Henry's Law constant (water solution)
kH(T) = k°H exp(d(ln(kH))/d(1/T) ((1/T) - 1/(298.15 K)))
k°H = Henry's law constant for solubility in water at 298.15 K (mol/(kg*bar))
d(ln(kH))/d(1/T) = Temperature dependence constant (K)
k°H (mol/(kg*bar)) | d(ln(kH))/d(1/T) (K) | Method | Reference | Comment |
---|---|---|---|---|
0.000099 | Q | N/A | missing citation give several references for the Henry's law constants but don't assign them to specific species. | |
0.00010 | L | N/A |

Kovats' RI, non-polar column, custom temperature program

Data compiled by: NIST Mass Spectrometry Data Center, William E. Wallace, director

Column type CapillaryCapillaryCapillaryCapillary
Active phase Petrocol DH-100DB-1SqualaneSqualane
Column length (m) 100.60.
Carrier gas HeHe
Substrate
Column diameter (mm) 0.20.32
Phase thickness (μm)  1.0
Program 5C(10min) => 5C/min => 50C(48min) => 1.5C/min => 195C(91min)-40 C for 12 min; -40 - 125 C at 3 deg.min; 125-185 C at 6 deg/min; 185 - 220 C at 20 deg/min; hold 220 C for 2 minnot specifiednot specified
I 874.4868.863.864.
ReferenceHaagen-Smit Laboratory, 1997Hoekman, 1993Korol and Lysyuk, 1980Korol and Lysyuk, 1980
Comment MSDC-RI MSDC-RI MSDC-RI MSDC-RI

Normal alkane RI, non-polar column, temperature ramp

Data compiled by: NIST Mass Spectrometry Data Center, William E. Wallace, director

Column type CapillaryCapillaryCapillaryCapillaryCapillary
Active phase Polydimethyl siloxane: CP-Sil 5 CBOptima-5 MSPetrocol DHOV-1BP-1
Column length (m) 60.30.100.100.50.
Carrier gas HeliumHeliumHeliumHeliumHe
Substrate
Column diameter (mm) 0.250.250.250.320.22
Phase thickness (μm) 1.00.250.500.250.75
Tstart (C) 45.35.20.30.50.
Tend (C) 210.250.220.310.200.
Heat rate (K/min) 3.610.15.5.5.
Initial hold (min) 1.453.15.
Final hold (min) 2.725.30.5.
I 865.866.867.864.1865.
ReferenceBramston-Cook, 2013Goeminne, Vandendriessche, et al., 2012Supelco, 2012Krkosova, Kubinec, et al., 2007Health Safety Executive, 2000
Comment MSDC-RI MSDC-RI MSDC-RI MSDC-RI MSDC-RI

Normal alkane RI, non-polar column, isothermal

Data compiled by: NIST Mass Spectrometry Data Center, William E. Wallace, director

Column type CapillaryCapillaryCapillaryCapillary
Active phase Methyl SiliconeOV-101OV-101Apiezon L
Column length (m) 74.6  2.
Carrier gas N2
Substrate
Column diameter (mm) 0.28
Phase thickness (μm)
Temperature (C) 50.50.70.40. - 190.
I 863.864.865.864.
ReferenceN/AWu and Lu, 1984Wu and Lu, 1984Mann, Mühlstädt, et al., 1967
Comment MSDC-RI MSDC-RI MSDC-RI MSDC-RI

References

Pomerantz, Fookson, et al., 1954
Pomerantz, P.; Fookson, A.; Mears, T.W.; Rothberg, S.; Howard, F.L.,
Synth. and Phys. Prop. of Several Aliphatic and Alicyclic Hydrocarbons hydrocarbons,
J. Res. Natl. Bur. Stand. (U. S.), 1954, 52, 59-65. [all data]
Slabey and Wise, 1952
Slabey, V.A.; Wise, P.H.,
Hydrogenation of 2-Cyclopropyl-1- and -2-Alkenes. Isolation and Purification of 2-Cyclopropylalkanes,
J. Am. Chem. Soc., 1952, 74, 3887. [all data]
White and Glasgow, 1937
White, J.D.; Glasgow, A.R.,
Separation of the Three Methyl Octanes from Midcontinent Petroleum,
J. Res. Natl. Bur. Stand. (U. S.), 1937, 19, 423. [all data]
Reid, 1972
Reid, Robert C.,
Handbook on vapor pressure and heats of vaporization of hydrocarbons and related compounds, R. C. Wilhort and B. J. Zwolinski, Texas A Research Foundation. College Station, Texas(1971). 329 pages.$10.00,
AIChE J., 1972, 18, 6, 1278-1278, https://doi.org/10.1002/aic.690180637
. [all data]
Labbauf, Greenshields, et al., 1961
Labbauf, A.; Greenshields, J.B.; Rossini, F.D.,
Heats of formation, combustion, and vaporization of the 35 nonanes and 75 decanes,
J. Chem. Eng. Data, 1961, 6, 261-263. [all data]