Heptane, 2,5-dimethyl-
- Formula: C9H20
- Molecular weight: 128.2551
- IUPAC Standard InChIKey: HQZHQNKZOYIKQC-UHFFFAOYSA-N
- CAS Registry Number: 2216-30-0
- Chemical structure:
View 3d structure (requires JavaScript / HTML 5) - Species with the same structure:
- Other names: 2,5-Dimethylheptane

Phase change data

Data compiled as indicated in comments:
TRC - Thermodynamics Research Center, NIST Boulder Laboratories, Chris Muzny director
AC - William E. Acree, Jr., James S. Chickos
Quantity | Value | Units | Method | Reference | Comment |
---|---|---|---|---|---|
Tboil | 408. ± 2. | K | AVG | N/A | Average of 9 values; Individual data points |
Quantity | Value | Units | Method | Reference | Comment |
ΔvapH° | 10.3 | kcal/mol | N/A | Reid, 1972 | See also Labbauf, Greenshields, et al., 1961.; AC |

Kovats' RI, non-polar column, isothermal

Column type | Active phase | Temperature (C) | I | Reference | Comment |
---|---|---|---|---|---|
Capillary | OV-101 | 60. | 836.3 | Chen, Liang, et al., 2001 | He; Column length: 50. m; Column diameter: 0.25 mm |
Capillary | Squalane | 100. | 834. | Heinzen, Soares, et al., 1999 | |
Capillary | HP-1 | 60. | 837. | Zhang, Li, et al., 1992 | N2; Column length: 25. m; Column diameter: 0.20 mm |
Capillary | HP-1 | 60. | 840. | Zhang, Li, et al., 1992 | N2; Column length: 25. m; Column diameter: 0.20 mm |
Capillary | Squalane | 50. | 831.8 | Lunskii and Paizanskaya, 1988 | He; Column length: 50. m; Column diameter: 0.22 mm |
Capillary | Squalane | 70. | 832.4 | Lunskii and Paizanskaya, 1988 | He; Column length: 50. m; Column diameter: 0.22 mm |
Capillary | DB-1 | 60. | 836.9 | Lubeck and Sutton, 1983 | Column length: 60. m; Column diameter: 0.264 mm |
Capillary | DB-1 | 60. | 836.9 | Lubeck and Sutton, 1983 | 60. m/0.259 mm/1. μm |
Capillary | Squalane | 86. | 833.6 | Nabivach and Kirilenko, 1979 | N2; Column length: 50. m |
Capillary | Squalane | 86. | 834.0 | Nabivach and Kirilenko, 1979 | N2; Column length: 50. m |
Capillary | Squalane | 60. | 833.7 | Chretien and Dubois, 1976 | |
Capillary | Squalane | 100. | 832.9 | Lulova, Leont'eva, et al., 1976 | He; Column length: 120. m; Column diameter: 0.25 mm |
Capillary | Squalane | 100. | 832.9 | Lulova, Leont'eva, et al., 1976 | He; Column length: 120. m; Column diameter: 0.25 mm |
Capillary | Vacuum Grease Oil (VM-4) | 95. | 832.8 | Sultanov and Arustamova, 1975 | N2; Column length: 150. m; Column diameter: 0.25 mm |
Capillary | Vacuum Grease Oil (VM-4) | 35. | 827. | Sidorov, Petrova, et al., 1972 | |
Capillary | Vacuum Grease Oil (VM-4) | 45. | 828. | Sidorov, Petrova, et al., 1972 | |
Capillary | Vacuum Grease Oil (VM-4) | 50. | 828. | Sidorov, Petrova, et al., 1972 | |
Capillary | Vacuum Grease Oil (VM-4) | 58. | 829. | Sidorov, Petrova, et al., 1972 | |
Capillary | Vacuum Grease Oil (VM-4) | 68. | 830. | Sidorov, Petrova, et al., 1972 | |
Packed | Squalane | 50. | 832.9 | Takács, Szita, et al., 1971 | N2, Chromosorb W; Column length: 3. m |
Packed | SE-30 | 80. | 834. | Mitra and Saha, 1970 | N2 |
Packed | Squalane | 80. | 833. | Mitra and Saha, 1970 | N2 |
Capillary | Squalane | 60. | 833. | Matukuma, 1969 | N2; Column length: 91.4 m; Column diameter: 0.25 mm |
Capillary | Squalane | 80. | 834. | Schomburg, 1967 | Ar; Column length: 100. m |
Capillary | Squalane | 30. | 832. | Tourres, 1967 | H2; Column length: 100. m; Column diameter: 0.25 mm |
Capillary | Squalane | 50. | 833. | Tourres, 1967 | H2; Column length: 100. m; Column diameter: 0.25 mm |
Capillary | Squalane | 70. | 834. | Tourres, 1967 | H2; Column length: 100. m; Column diameter: 0.25 mm |

Kovats' RI, non-polar column, temperature ramp

Column type | Active phase | I | Reference | Comment |
---|---|---|---|---|
Capillary | OV-101 | 833. | Hayes and Pitzer, 1982 | 110. m/0.25 mm/0.20 μm, He, 1. K/min; Tstart: 35. C; Tend: 200. C |

Kovats' RI, non-polar column, custom temperature program

Column type | Active phase | I | Reference | Comment |
---|---|---|---|---|
Capillary | Petrocol DH-100 | 843.3 | Haagen-Smit Laboratory, 1997 | He; Column length: 100. m; Column diameter: 0.2 mm; Program: 5C(10min) => 5C/min => 50C(48min) => 1.5C/min => 195C(91min) |
Capillary | Squalane | 833. | Korol and Lysyuk, 1980 | Program: not specified |

Van Den Dool and Kratz RI, non-polar column, temperature ramp

Column type | Active phase | I | Reference | Comment |
---|---|---|---|---|
Capillary | Petrocol DH | 837.8 | Censullo, Jones, et al., 2003 | 50. m/0.25 mm/0.5 μm, He, 35. C @ 10. min, 3. K/min, 200. C @ 10. min |
Capillary | OV-101 | 835.5 | Yin, Liu, et al., 2001 | N2, 1. K/min; Column length: 80. m; Column diameter: 0.22 mm; Tstart: 30. C; Tend: 130. C |
Capillary | PONA | 827.4 | Martos, Saraullo, et al., 1997 | 50. m/0.2 mm/0.5 μm, 35. C @ 0.5 min, 1. K/min, 220. C @ 8. min |
Capillary | PONA | 833.3 | Martos, Saraullo, et al., 1997 | 50. m/0.2 mm/0.5 μm, 35. C @ 0.5 min, 1. K/min, 220. C @ 8. min |
Capillary | Petrocol DH | 834.63 | Subramaniam, Bochniak, et al., 1994 | 100. m/0.25 mm/0.5 μm, He, 1. K/min; Tstart: 30. C; Tend: 220. C |
Capillary | Petrocol DH | 834.81 | Subramaniam, Bochniak, et al., 1994 | 100. m/0.25 mm/0.5 μm, He, 1. K/min; Tstart: 30. C; Tend: 220. C |
Capillary | Ultra-1 | 831. | Olson, Sinkevitch, et al., 1992 | 4. K/min; Tstart: -40. C; Tend: 230. C |
Capillary | Petrocol DH | 837. | White, Hackett, et al., 1992 | 100. m/0.25 mm/0.5 μm, He, 1. K/min; Tstart: 30. C; Tend: 220. C |
Capillary | OV-101 | 833. | Hayes and Pitzer, 1981 | 108. m/0.25 mm/0.2 μm, 1. K/min; Tstart: 35. C; Tend: 200. C |

Van Den Dool and Kratz RI, non-polar column, custom temperature program

Column type | Active phase | I | Reference | Comment |
---|---|---|---|---|
Capillary | OV-101 | 836. | Wu and Lu, 1984 | Program: not specified |

Normal alkane RI, non-polar column, isothermal

Column type | Active phase | Temperature (C) | I | Reference | Comment |
---|---|---|---|---|---|
Capillary | Methyl Silicone | 50. | 833. | N/A | N2; Column length: 74.6 m; Column diameter: 0.28 mm |
Capillary | OV-101 | 50. | 836. | Wu and Lu, 1984, 2 | |
Capillary | OV-101 | 70. | 837. | Wu and Lu, 1984, 2 | |
Capillary | Squalane | 70. | 833. | Schomburg, 1966 |

Normal alkane RI, non-polar column, temperature ramp

Column type | Active phase | I | Reference | Comment |
---|---|---|---|---|
Capillary | Polydimethyl siloxane: CP-Sil 5 CB | 847. | Bramston-Cook, 2013 | 60. m/0.25 mm/1.0 μm, Helium, 45. C @ 1.45 min, 3.6 K/min, 210. C @ 2.72 min |
Capillary | Petrocol DH | 840. | Supelco, 2012 | 100. m/0.25 mm/0.50 μm, Helium, 20. C @ 15. min, 15. K/min, 220. C @ 30. min |
Capillary | PONA | 838. | Zhang, Ding, et al., 2009 | 50. m/0.20 mm/0.50 μm, Nitrogen, 35. C @ 15. min, 2. K/min, 200. C @ 10. min |

Normal alkane RI, non-polar column, custom temperature program

Column type | Active phase | I | Reference | Comment |
---|---|---|---|---|
Capillary | Methyl Silicone | 839. | Blunden, Aneja, et al., 2005 | 60. m/0.32 mm/1.0 μm, Helium; Program: -50 0C (2 min) 8 0C/min -> 200 0C (7.75 min) 25 0C -> 225 0C (8 min) |
Capillary | OV-101 | 833. | Du and Liang, 2003 | Program: not specified |
Capillary | Polydimethyl siloxane | 834. | Junkes, Castanho, et al., 2003 | Program: not specified |
Capillary | Polydimethyl siloxanes | 836. | Yin, Guo, et al., 2001 | Program: not specified |
Capillary | Methyl Silicone | 841. | Spieksma, 1999 | Program: not specified |
Capillary | OV-1 | 836. | Zhu and He, 1999 | Program: not specified |
Capillary | OV-1 | 837. | Zhu and He, 1999 | Program: not specified |
Capillary | Methyl Silicone | 833. | Zenkevich, 1995 | Program: not specified |
Capillary | DB-1 | 839. | Ciccioli, Cecinato, et al., 1994 | 60. m/0.32 mm/0.25 μm; Program: not specified |
Capillary | Squalane | 830. | Petrov, 1984 | Program: not specified |
Capillary | OV-1, SE-30, Methyl silicone, SP-2100, OV-101, DB-1, etc. | 833. | Waggott and Davies, 1984 | Hydrogen; Column length: 50. m; Column diameter: 0.32 mm; Program: not specified |

Henry's Law data

Data compiled by: Rolf Sander

Henry's Law constant (water solution)

kH(T) = H exp(d(ln(kH))/d(1/T) ((1/T) - 1/(298.15 K)))
H = Henry's law constant for solubility in water at 298.15 K (mol/(kg*bar))
d(ln(kH))/d(1/T) = Temperature dependence constant (K)

H (mol/(kg*bar)) d(ln(kH))/d(1/T) (K) Method Reference Comment
0.00020 QN/A missing citation give several references for the Henry's law constants but don't assign them to specific species.

References

Reid, 1972
Reid, Robert C.,
Handbook on vapor pressure and heats of vaporization of hydrocarbons and related compounds, R. C. Wilhort and B. J. Zwolinski, Texas A Research Foundation. College Station, Texas(1971). 329 pages.$10.00,
AIChE J., 1972, 18, 6, 1278-1278, https://doi.org/10.1002/aic.690180637
. [all data]
Labbauf, Greenshields, et al., 1961
Labbauf, A.; Greenshields, J.B.; Rossini, F.D.,
Heats of formation, combustion, and vaporization of the 35 nonanes and 75 decanes,
J. Chem. Eng. Data, 1961, 6, 261-263. [all data]
Chen, Liang, et al., 2001
Chen, J.P.; Liang, X.M.; Zhang, Q.; Zhang, L.F.,
Prediction of GC retention values under various column temperature conditions from temperature programmed data,
Chromatographia, 2001, 53, 9/10, 539-547, https://doi.org/10.1007/BF02491619
. [all data]
Heinzen, Soares, et al., 1999
Heinzen, V.E.F.; Soares, M.F.; Yunes, R.A.,
Semi-empirical topological method for the prediction of the chromatographic retention of cis- and trans-alkene isomers and alkanes,
J. Chromatogr. A, 1999, 849, 2, 495-506, https://doi.org/10.1016/S0021-9673(99)00530-0
. [all data]
Zhang, Li, et al., 1992
Zhang, M.J.; Li, S.D.; Chen, B.J.,
Compositional studies of high-temperature coal tar by GC/FTIR analysis of light oil fractions,
Chromatographia, 1992, 33, 3/4, 138-146, https://doi.org/10.1007/BF02275894
. [all data]
Lunskii and Paizanskaya, 1988
Lunskii, M.Kh.; Paizanskaya, I.L.,
Identification of hydrocarbons C1-C9 of petrol fractions of oils and condensates in the use of capillary columns with dinonylphthalate,
Zh. Anal. Khim., 1988, 43, 127-135. [all data]
Lubeck and Sutton, 1983
Lubeck, A.J.; Sutton, DL.,
Kovats retention indices of selected hydrocarbons through C10 on bonded phase fused silica capillaries,
J. Hi. Res. Chromatogr. Chromatogr. Comm., 1983, 6, 6, 328-332, https://doi.org/10.1002/jhrc.1240060612
. [all data]
Nabivach and Kirilenko, 1979
Nabivach, V.M.; Kirilenko, A.V.,
The use of retention indices for identifying the components of crude benzene,
Solid Fuel Chem. (Engl. Transl.), 1979, 13, 3, 82-87. [all data]
Chretien and Dubois, 1976
Chretien, J.R.; Dubois, J.-E.,
New Perspectives in the Prediction of Kovats Indices,
J. Chromatogr., 1976, 126, 171-189, https://doi.org/10.1016/S0021-9673(01)84071-1
. [all data]
Lulova, Leont'eva, et al., 1976
Lulova, N.I.; Leont'eva, S.A.; Timofeeva, A.N.,
Gas-chromatographic method of determination of individual hydrocarbons in catalytic cracking gasolines
in Proceedings of All-Union Research Institute on Oil Processes. Vol.18, All-Union Research Institute on Oil Processes, Moscow, 1976, 30-53. [all data]
Sultanov and Arustamova, 1975
Sultanov, N.T.; Arustamova, L.G.,
Determination of the boiling points of C10 isoalkanes in an n-decane isomerizate from gas chromatographic retention indices,
J. Chromatogr., 1975, 115, 2, 553-558, https://doi.org/10.1016/S0021-9673(01)98959-9
. [all data]
Sidorov, Petrova, et al., 1972
Sidorov, R.I.; Petrova, V.I.; Ivanova, M.P.,
Qualitative analysis of wide-boiling fraction C5-C10 with capillary chromatography
in Processes in chromatographic columns. Vol.17, 1972, 14-25. [all data]
Takács, Szita, et al., 1971
Takács, J.; Szita, C.; Tarján, G.,
Contribution to the theory of the retention index system. III. Retention index and molecular structure. Calculation of retention indices of paraffin hydrocarbons on the basis of their molecular structure,
J. Chromatogr., 1971, 56, 1-12, https://doi.org/10.1016/S0021-9673(00)97771-9
. [all data]
Mitra and Saha, 1970
Mitra, G.D.; Saha, N.C.,
Determination of Retention Indices of Saturated Hydrocarbons by Graphical Methods,
J. Chromatogr. Sci., 1970, 8, 2, 95-102, https://doi.org/10.1093/chromsci/8.2.95
. [all data]
Matukuma, 1969
Matukuma, A.,
Retention indices of alkanes through C10 and alkenes through C8 and relation between boiling points and retention data,
Gas Chromatogr., Int. Symp. Anal. Instrum. Div Instrum Soc. Amer., 1969, 7, 55-75. [all data]
Schomburg, 1967
Schomburg, G.,
Struktur und Retentionsverhalten von Offenkettigen und Cyclischen Kohlenwasserstoffen und Deren Einfacher Substitutionsprodukte,
Anal. Chim. Acta., 1967, 38, 45-64, https://doi.org/10.1016/S0003-2670(01)80560-2
. [all data]
Tourres, 1967
Tourres, D.A.,
Structure moléculaire et rétention en chromatographie en phase gazeuse. Influence de la température sur l'indice de rétention d'alcanes isomères,
J. Chromatogr., 1967, 30, 357-377, https://doi.org/10.1016/S0021-9673(00)84168-0
. [all data]
Hayes and Pitzer, 1982
Hayes, P.C., Jr.; Pitzer, E.W.,
Characterizing petroleum- and shale-derived jet fuel distillates via temperature-programmed Kováts indices,
J. Chromatogr., 1982, 253, 179-198, https://doi.org/10.1016/S0021-9673(01)88376-X
. [all data]
Haagen-Smit Laboratory, 1997
Haagen-Smit Laboratory,
Procedure for the detailed hydrocarbon analysis of gasolines by single column high efficiency (capillary) column gas chromatography, SOP NO. MLD 118, Revision No. 1.1, California Environmental Protection Agency, Air Resources Board, El Monte, California, 1997, 22. [all data]
Korol and Lysyuk, 1980
Korol, A.N.; Lysyuk, L.S.,
A New Thermodynamic Method for Calculating the Retention Indices of Isoalkanes on Squalane,
Theor. Exp. Chem. (Engl. Transl.), 1980, 6, 577-584. [all data]
Censullo, Jones, et al., 2003
Censullo, A.C.; Jones, D.R.; Wills, M.T.,
Speciation of the volatile organic compounds (VOCs) in solventborne aerosol coatings by solid phase microextraction-gas chromatography,
J. Coat. Technol., 2003, 75, 936, 47-53, https://doi.org/10.1007/BF02697922
. [all data]
Yin, Liu, et al., 2001
Yin, C.; Liu, W.; Li, Z.; Pan, Z.; Lin, T.; Zhang, M.,
Chemometrics to chemical modeling: structural coding in hydrocarbons and retention indices of gas chromatography,
J. Sep. Sci., 2001, 24, 3, 213-220, https://doi.org/10.1002/1615-9314(20010301)24:3<213::AID-JSSC213>3.0.CO;2-4
. [all data]
Martos, Saraullo, et al., 1997
Martos, P.A.; Saraullo, A.; Pawliszyn, J.,
Estimation of air/coating distribution coefficients for solid phase microextraction using retention indexes from linear temperature-programmed capillary gas chromatography. Application to the sampling and analysis of total petroleum hydrocarbons in air,
Anal. Chem., 1997, 69, 3, 402-408, https://doi.org/10.1021/ac960633p
. [all data]
Subramaniam, Bochniak, et al., 1994
Subramaniam, B.; Bochniak, D.; Snavely, K.,
Fischer-Tropsch synthesis in supercritical reaction media, Lawrence Department of Chemical and Petroleum Engineering (DOE/PC/92532--T7), United States Department of Energy, Pittsburgh, PA, 1994, 8, retrieved from http://www.NTIS.gov. [all data]
Olson, Sinkevitch, et al., 1992
Olson, K.L.; Sinkevitch, R.M.; Sloane, T.M.,
Speciation and Quantitation of Hydrocarbons in Gasoline Engine Exhaust,
J. Chromatogr. Sci., 1992, 30, 12, 500-508, https://doi.org/10.1093/chromsci/30.12.500
. [all data]
White, Hackett, et al., 1992
White, C.M.; Hackett, J.; Anderson, R.R.; Kail, S.; Spock, P.S.,
Linear temperature programmed retention indices of gasoline range hydrocarbons and chlorinated hydrocarbons on cross-linked polydimethylsiloxane,
J. Hi. Res. Chromatogr., 1992, 15, 2, 105-120, https://doi.org/10.1002/jhrc.1240150211
. [all data]
Hayes and Pitzer, 1981
Hayes, P.C., Jr.; Pitzer, E.W.,
Kovats indices as a tool in characterizing hydrocarbon fuels in temperature programmed glass capillary gas chromatography. Part 1. Qualitative identification, Inhouse rpt. for Air Force Wright Aeronautical Labs., Air Force Wright Aeronautical Labs., Wright-Patterson AFB, Ohio, 1981, 75. [all data]
Wu and Lu, 1984
Wu, J.; Lu, W.,
Hydrocarbon analysis by open-tubular column chromatography with programmed temperature for straight run gasoline,
Anal. Chem., 1984, 12, 7, 572-578. [all data]
Wu and Lu, 1984, 2
Wu, J.; Lu, W.,
Kovats indices of C4-C10 hydrocarbons in apolar quartz capillary OV-101,
Chin. J. Chromatogr., 1984, 1, 1, 11-17. [all data]
Schomburg, 1966
Schomburg, G.,
Gaschromatographische Retentionsdaten und Struktur Chemischer Verbindungen. II. Methylverzweigungen und Doppelbindungen in Offenkettigen Kohlenwasserstoffen,
J. Chromatogr., 1966, 23, 1-17, https://doi.org/10.1016/S0021-9673(01)98652-2
. [all data]
Bramston-Cook, 2013
Bramston-Cook, R.,
Kovats indices for C2-C13 hydrocarbons and selected oxygenated/halocarbons with 100 % dimethylpolysiloxane columns, 2013, retrieved from http://lotusinstruments.com/monographs/List .... [all data]
Supelco, 2012
Supelco, CatalogNo. 24160-U,
Petrocol DH Columns. Catalog No. 24160-U, 2012, retrieved from http://www.sigmaaldrich.com/etc/medialib/docs/Supelco/Datasheet/1/w97949.Par.0001.File.tmp/w97949.pdf. [all data]
Zhang, Ding, et al., 2009
Zhang, X.; Ding, L.; Sun, Z.; Song, L.; Sun, T.,
Study on quantitative structure-retention relationships for hydrocarbons in FCC gasoline,
Chromatographia, 2009, 70, 3/4, 511-518, https://doi.org/10.1365/s10337-009-1174-0
. [all data]
Blunden, Aneja, et al., 2005
Blunden, J.; Aneja, V.P.; Lonneman, W.A.,
Characterization of non-methane volatile organic compounds at swine facilities in eastern North Carolina,
Atm. Environ., 2005, 39, 36, 6707-6718, https://doi.org/10.1016/j.atmosenv.2005.03.053
. [all data]
Du and Liang, 2003
Du, Y.; Liang, Y.,
Data mining for seeking accurate quantitative relationship between molecular structure and GC retention indices of alkanes by projection pursuit,
Comput. Biol. Chem., 2003, 27, 3, 339-353, https://doi.org/10.1016/S1476-9271(02)00081-6
. [all data]
Junkes, Castanho, et al., 2003
Junkes, B.S.; Castanho, R.D.M.; Amboni, C.; Yunes, R.A.; Heinzen, V.E.F.,
Semiempirical Topological Index: A Novel Molecular Descriptor for Quantitative Structure-Retention Relationship Studies,
Internet Electronic Journal of Molecular Design, 2003, 2, 1, 33-49. [all data]
Yin, Guo, et al., 2001
Yin, C.; Guo, W.; Lin, T.; Liu, S.; Fu, R.; Pan, Z.; Wang, L.,
Application of wavelet neural network to the prediction of gas chromatographic retention indices of alkanes,
J. Chinese Chem. Soc., 2001, 48, 739-749. [all data]
Spieksma, 1999
Spieksma, W.,
Determination of vapor liquid equilibrium from the Kovats retention index on dimethylsilicone using the Wilson mixing tool,
J. Hi. Res. Chromatogr., 1999, 22, 10, 565-588, https://doi.org/10.1002/(SICI)1521-4168(19991001)22:10<565::AID-JHRC565>3.0.CO;2-2
. [all data]
Zhu and He, 1999
Zhu, X.; He, L.,
Derivation of isothermal retention indices from a retention values under multiple-ramp temperature-programmed conditions,
J. Instrum. Anal. (Chinese), 1999, 18, 6, 10-12. [all data]
Zenkevich, 1995
Zenkevich, I.G.,
Calculation of Gas-Chromatographic Retention Indices from Physico-Chemical Constants of Organic Compounds,
Z. Anal. Chem., 1995, 50, 10, 1048-1056. [all data]
Ciccioli, Cecinato, et al., 1994
Ciccioli, P.; Cecinato, A.; Brancaleoni, E.; Brachetti, A.; Frattoni, M.; Sparapani, R.,
Composition and Distribution of Polar and Non-Polar VOCs in Urban, Rural, Forest and Remote Areas,
Eur Commission EUR, 1994, 549-568. [all data]
Petrov, 1984
Petrov, A.A.,
Hydrocarbons of petroleum, Nauka (publishing house), Moscow, 1984, 263. [all data]
Waggott and Davies, 1984
Waggott, A.; Davies, I.W.,
Identification of organic pollutants using linear temperature programmed retention indices (LTPRIs) - Part II, 1984, retrieved from http://dwi.defra.gov.uk/research/completed-research/reports/dwi0383.pdf. [all data]