N,N-Diethyl-3-nitroaniline
- Formula: C10H14N2O2
- Molecular weight: 194.2304
- IUPAC Standard InChIKey: QSNHMSRICSDACJ-UHFFFAOYSA-N
- CAS Registry Number: 2216-16-2
- Chemical structure:
View 3d structure (requires JavaScript / HTML 5) - Other names: N,N-Diethyl-m-nitroaniline; Benzenamine, N,N-diethyl-3-nitro-

Phase change data

Data compiled by: Robert L. Brown and Stephen E. Stein
Quantity | Value | Units | Method | Reference | Comment |
---|---|---|---|---|---|
Tboil | 562.2 | K | N/A | Weast and Grasselli, 1989 |
Reduced pressure boiling point
Tboil (K) | Pressure (bar) | Reference |
---|---|---|
447. to 449. | 0.024 | Frinton Laboratories Inc., 1986 |

References

Weast and Grasselli, 1989
CRC Handbook of Data on Organic Compounds, 2nd Editon, Weast,R.C and Grasselli, J.G., ed(s)., CRC Press, Inc., Boca Raton, FL, 1989, 1. [all data]
Frinton Laboratories Inc., 1986
Frinton Laboratories Inc.,
Catalog Number 11, Frinton Laboratories Inc., Vineland, NJ, 1986, 99. [all data]