(R)-(-)-2-chlorobutane
- Formula: C4H9Cl
- Molecular weight: 92.567
- IUPAC Standard InChIKey: BSPCSKHALVHRSR-BYPYZUCNSA-N
- CAS Registry Number: 22157-31-9
- Chemical structure:
View 3d structure (requires JavaScript / HTML 5) - Stereoisomers:

Phase change data

Data compiled by: Thermodynamics Research Center, NIST Boulder Laboratories, Chris Muzny director
Quantity | Value | Units | Method | Reference | Comment |
---|---|---|---|---|---|
Tfus | 133.15 | K | N/A | Timmermans and Martin, 1928 | Uncertainty assigned by TRC = 0.5 K |

References

Timmermans and Martin, 1928
Timmermans, J.; Martin, F.,
Study of the Physical Constants of Twenty Organic Compounds of the Physical Constants of Twenty Organic Compounds,
J. Chim. Phys. Phys.-Chim. Biol., 1928, 25, 411. [all data]