1-Phenyl-1-butanol
- Formula: C10H14O
- Molecular weight: 150.2176
- IUPAC Standard InChIKey: HQRWWHIETAKIMO-JTQLQIEISA-N
- CAS Registry Number: 22144-60-1
- Chemical structure:
View 3d structure (requires JavaScript / HTML 5) - Stereoisomers:

Phase change data

Data compiled by: Robert L. Brown and Stephen E. Stein
Reduced pressure boiling point
Tboil (K) | Pressure (bar) | Reference |
---|---|---|
388.2 | 0.019 | Aldrich Chemical Company Inc., 1990 |

References

Aldrich Chemical Company Inc., 1990
Aldrich Chemical Company Inc.,
Catalog Handbook of Fine Chemicals, Aldrich Chemical Company, Inc., Milwaukee WI, 1990, 1. [all data]