3,4-Dimethyl-2-hexene
- Formula: C8H16
- Molecular weight: 112.2126
- IUPAC Standard InChIKey: FMNLVKMLDPGPRY-UHFFFAOYSA-N
- CAS Registry Number: 2213-37-8
- Chemical structure:
View 3d structure (requires JavaScript / HTML 5) - Stereoisomers:
- Other names: 2-Hexene, 3,4-dimethyl; 3,4-Dimethyl-trans-2-hexene

Phase change data

Data compiled by: Thermodynamics Research Center, NIST Boulder Laboratories, Chris Muzny director
Quantity | Value | Units | Method | Reference | Comment |
---|---|---|---|---|---|
Tboil | 388.7 | K | N/A | Horney and Smittenberg, 1937 | Uncertainty assigned by TRC = 1.5 K |
Tboil | 388.6 | K | N/A | Horney and Smittenberg, 1937 | Uncertainty assigned by TRC = 1.5 K |

Kovats' RI, non-polar column, isothermal

Column type | Active phase | Temperature (C) | I | Reference | Comment |
---|---|---|---|---|---|
Capillary | Squalane | 100. | 767.5 | Lulova, Leont'eva, et al., 1976 | He; Column length: 120. m; Column diameter: 0.25 mm |
Packed | Squalane | 30. | 759. | Tourres, 1967 | H2; Column length: 10. m |
Packed | Squalane | 50. | 760.5 | Tourres, 1967 | H2; Column length: 10. m |

References

Horney and Smittenberg, 1937
Horney, A.G.; Smittenberg, J.,
Higher Type Olefins from Alkyl Substituted Bromoethylenes and Alkyl Halides by Means of Sodium or Magnesium and the Wurtz Reaction, Ph.D. Dissertation, Ohio State Univ., Columbus, 1937. [all data]
Lulova, Leont'eva, et al., 1976
Lulova, N.I.; Leont'eva, S.A.; Timofeeva, A.N.,
Gas-chromatographic method of determination of individual hydrocarbons in catalytic cracking gasolines
in Proceedings of All-Union Research Institute on Oil Processes. Vol.18, All-Union Research Institute on Oil Processes, Moscow, 1976, 30-53. [all data]
Tourres, 1967
Tourres, D.A.,
Structural analysis of industrial butene dimers by gas chromatography,
J. Gas Chromatogr., 1967, 5, 1, 35-40, https://doi.org/10.1093/chromsci/5.1.35
. [all data]