2-Chloro-1-butene
- Formula: C4H7Cl
- Molecular weight: 90.551
- IUPAC Standard InChIKey: HSEFPJMMKNHABB-UHFFFAOYSA-N
- CAS Registry Number: 2211-70-3
- Chemical structure:
View 3d structure (requires JavaScript / HTML 5) - Other names: 2-chlorobut-1-ene; 1-Butene, 2-chloro-

Gas phase thermochemistry data

Data compiled by: Hussein Y. Afeefy, Joel F. Liebman, and Stephen E. Stein
Quantity | Value | Units | Method | Reference | Comment |
---|---|---|---|---|---|
ΔfH°gas | -29.3 | kJ/mol | Eqk | Levanova, Rodova, et al., 1974 |

Phase change data

Data compiled as indicated in comments:
BS - Robert L. Brown and Stephen E. Stein
TRC - Thermodynamics Research Center, NIST Boulder Laboratories, Chris Muzny director
Quantity | Value | Units | Method | Reference | Comment |
---|---|---|---|---|---|
Tboil | 331.7 | K | N/A | Weast and Grasselli, 1989 | BS |
Tboil | 331.65 | K | N/A | Kinney, 1942 | Uncertainty assigned by TRC = 1. K; uncertain whether this was measured; TRC |
Tboil | 331.65 | K | N/A | Navez, 1930 | Uncertainty assigned by TRC = 1. K; TRC |

Reaction thermochemistry data

Data compiled by: Hussein Y. Afeefy, Joel F. Liebman, and Stephen E. Stein
Individual Reactions
By formula: C4H7Cl = C4H7Cl + HCl
Quantity | Value | Units | Method | Reference | Comment |
---|---|---|---|---|---|
ΔrH° | 64.0 ± 0.3 | kJ/mol | Eqk | Levanova, Rozhnov, et al., 1972 | gas phase; At 404.5 K |
By formula: C4H7Cl = C4H7Cl
Quantity | Value | Units | Method | Reference | Comment |
---|---|---|---|---|---|
ΔrH° | -14. | kJ/mol | Eqk | Levanova, Rodova, et al., 1975 | gas phase |
By formula: C4H7Cl = C4H7Cl
Quantity | Value | Units | Method | Reference | Comment |
---|---|---|---|---|---|
ΔrH° | -2.1 | kJ/mol | Eqk | Levanova, Rodova, et al., 1975 | gas phase |

References

Levanova, Rodova, et al., 1974
Levanova, S.V.; Rodova, R.M.; Rozhnov, A.M.; Shevtsova, L.A.,
Thermodynamic calculation of the equilibrium composition of chlorobutene mixtures,
Russ. J. Phys. Chem. (Engl. Transl.), 1974, 48, 1113-1114. [all data]
Weast and Grasselli, 1989
CRC Handbook of Data on Organic Compounds, 2nd Editon, Weast,R.C and Grasselli, J.G., ed(s)., CRC Press, Inc., Boca Raton, FL, 1989, 1. [all data]
Kinney, 1942
Kinney, C.R.,
A System Correlating Molecular Structure of Organic Compounds with Their Boiling Points VI. The Monohalogen Derivatives of the Various Hydrocarbons,
J. Org. Chem., 1942, 7, 111. [all data]
Navez, 1930
Navez, L.,
Bull. Soc. Chim. Belg., 1930, 39, 435. [all data]
Levanova, Rozhnov, et al., 1972
Levanova, S.V.; Rozhnov, A.M.; Bortnik, O.K.,
Isomerization of dibromoethylenes,
Izv. Vyssh. Uchebn. Zaved., Khim. Khim. Tekhnol., 1972, 15, 1821-1823. [all data]
Levanova, Rodova, et al., 1975
Levanova, S.V.; Rodova, R.M.; Shevtsova, L.A.; Rozhnov, A.M.,
Isomerisation of chlorobutenes,
Russ. J. Phys. Chem. (Engl. Transl.), 1975, 49, 41-43. [all data]