2-Butene, 2-chloro-, (Z)-
- Formula: C4H7Cl
- Molecular weight: 90.551
- IUPAC Standard InChIKey: DSDHFHLZEFQSFM-ARJAWSKDSA-N
- CAS Registry Number: 2211-69-0
- Chemical structure:
View 3d structure (requires JavaScript / HTML 5) - Species with the same structure:
- Stereoisomers:
- Other names: Cis-2-chloro-2-butene

Phase change data

Data compiled by: Thermodynamics Research Center, NIST Boulder Laboratories, Chris Muzny director
Quantity | Value | Units | Method | Reference | Comment |
---|---|---|---|---|---|
Tboil | 339.95 | K | N/A | Kinney, 1942 | Uncertainty assigned by TRC = 1. K; uncertain whether this was measured |
Tboil | 331.9 | K | N/A | Charpentier, 1934 | may contain 1-chloropropene |
Tboil | 339.95 | K | N/A | Navez, 1930 | Uncertainty assigned by TRC = 1. K |

Reaction thermochemistry data

Data compiled by: Hussein Y. Afeefy, Joel F. Liebman, and Stephen E. Stein
Individual Reactions
By formula: C4H8Cl2 = C4H7Cl + HCl
Quantity | Value | Units | Method | Reference | Comment |
---|---|---|---|---|---|
ΔrH° | -8.79 ± 0.08 | kJ/mol | Eqk | Levanova, Rozhnov, et al., 1972 | gas phase; At 568 K |
ΔrH° | 55.2 ± 0.3 | kJ/mol | Eqk | Levanova, Rozhnov, et al., 1972 | gas phase; At 404.5 K |
By formula: C4H8Cl2 = C4H7Cl + HCl
Quantity | Value | Units | Method | Reference | Comment |
---|---|---|---|---|---|
ΔrH° | 69.0 | kJ/mol | Eqk | Levanova, Rodova, et al., 1974 | gas phase |
ΔrH° | 66.53 ± 0.92 | kJ/mol | Eqk | Rodova, Levanova, et al., 1973 | gas phase; At 454 K |
By formula: C4H7Cl = C4H7Cl
Quantity | Value | Units | Method | Reference | Comment |
---|---|---|---|---|---|
ΔrH° | -2.1 | kJ/mol | Eqk | Levanova, Rodova, et al., 1975 | gas phase |

References

Kinney, 1942
Kinney, C.R.,
A System Correlating Molecular Structure of Organic Compounds with Their Boiling Points VI. The Monohalogen Derivatives of the Various Hydrocarbons,
J. Org. Chem., 1942, 7, 111. [all data]
Charpentier, 1934
Charpentier, P.,
Bull. Soc. Chim. Fr., 1934, 1, 1407. [all data]
Navez, 1930
Navez, L.,
Bull. Soc. Chim. Belg., 1930, 39, 435. [all data]
Levanova, Rozhnov, et al., 1972
Levanova, S.V.; Rozhnov, A.M.; Bortnik, O.K.,
Isomerization of dibromoethylenes,
Izv. Vyssh. Uchebn. Zaved., Khim. Khim. Tekhnol., 1972, 15, 1821-1823. [all data]
Levanova, Rodova, et al., 1974
Levanova, S.V.; Rodova, R.M.; Rozhnov, A.M.; Shevtsova, L.A.,
Thermodynamic calculation of the equilibrium composition of chlorobutene mixtures,
Russ. J. Phys. Chem. (Engl. Transl.), 1974, 48, 1113-1114. [all data]
Rodova, Levanova, et al., 1973
Rodova, R.M.; Levanova, S.V.; Shevtsova, L.A.; Rozhnov, A.M.; Porfir'eva, E.I.,
Reversible reactions of 2,3-dichlorobutane,
Russ. J. Phys. Chem. (Engl. Transl.), 1973, 47, 607. [all data]
Levanova, Rodova, et al., 1975
Levanova, S.V.; Rodova, R.M.; Shevtsova, L.A.; Rozhnov, A.M.,
Isomerisation of chlorobutenes,
Russ. J. Phys. Chem. (Engl. Transl.), 1975, 49, 41-43. [all data]