2-Butene, 2-chloro-, (E)-
- Formula: C4H7Cl
- Molecular weight: 90.551
- IUPAC Standard InChIKey: DSDHFHLZEFQSFM-ONEGZZNKSA-N
- CAS Registry Number: 2211-68-9
- Chemical structure:
View 3d structure (requires JavaScript / HTML 5) - Stereoisomers:
- Other names: Trans-2-chloro-2-butene

Phase change data

Data compiled by: Thermodynamics Research Center, NIST Boulder Laboratories, Chris Muzny director
Quantity | Value | Units | Method | Reference | Comment |
---|---|---|---|---|---|
Tboil | 334.65 | K | N/A | Gardenier, 1946 | Uncertainty assigned by TRC = 2.5 K |
Tboil | 335.75 | K | N/A | Kinney, 1942 | Uncertainty assigned by TRC = 1. K; uncertain whether this was measured |
Tboil | 338.15 | K | N/A | Charpentier, 1934 | Uncertainty assigned by TRC = 1.5 K |
Tboil | 335.75 | K | N/A | Navez, 1930 | Uncertainty assigned by TRC = 1. K |

Reaction thermochemistry data

Data compiled by: Hussein Y. Afeefy, Joel F. Liebman, and Stephen E. Stein
Individual Reactions
By formula: C4H8Cl2 = C4H7Cl + HCl
Quantity | Value | Units | Method | Reference | Comment |
---|---|---|---|---|---|
ΔrH° | -3.3 ± 0.02 | kcal/mol | Eqk | Levanova, Rozhnov, et al., 1972 | gas phase; At 568 K |
ΔrH° | 1.2 ± 0.06 | kcal/mol | Eqk | Levanova, Rozhnov, et al., 1972 | gas phase; At 404.5 K |
By formula: C4H8Cl2 = C4H7Cl + HCl
Quantity | Value | Units | Method | Reference | Comment |
---|---|---|---|---|---|
ΔrH° | 14.70 ± 0.22 | kcal/mol | Eqk | Rodova, Levanova, et al., 1973 | gas phase; At 454 K |
By formula: C4H7Cl = C4H7Cl
Quantity | Value | Units | Method | Reference | Comment |
---|---|---|---|---|---|
ΔrH° | -1.2 ± 0.01 | kcal/mol | Eqk | Levanova, Rozhnov, et al., 1972 | gas phase; At 568 K |
By formula: C4H7Cl = C4H7Cl
Quantity | Value | Units | Method | Reference | Comment |
---|---|---|---|---|---|
ΔrH° | -3.3 | kcal/mol | Eqk | Levanova, Rodova, et al., 1975 | gas phase |

References

Gardenier, 1946
Gardenier,
, 1946. [all data]
Kinney, 1942
Kinney, C.R.,
A System Correlating Molecular Structure of Organic Compounds with Their Boiling Points VI. The Monohalogen Derivatives of the Various Hydrocarbons,
J. Org. Chem., 1942, 7, 111. [all data]
Charpentier, 1934
Charpentier, P.,
Bull. Soc. Chim. Fr., 1934, 1, 1407. [all data]
Navez, 1930
Navez, L.,
Bull. Soc. Chim. Belg., 1930, 39, 435. [all data]
Levanova, Rozhnov, et al., 1972
Levanova, S.V.; Rozhnov, A.M.; Bortnik, O.K.,
Isomerization of dibromoethylenes,
Izv. Vyssh. Uchebn. Zaved., Khim. Khim. Tekhnol., 1972, 15, 1821-1823. [all data]
Rodova, Levanova, et al., 1973
Rodova, R.M.; Levanova, S.V.; Shevtsova, L.A.; Rozhnov, A.M.; Porfir'eva, E.I.,
Reversible reactions of 2,3-dichlorobutane,
Russ. J. Phys. Chem. (Engl. Transl.), 1973, 47, 607. [all data]
Levanova, Rodova, et al., 1975
Levanova, S.V.; Rodova, R.M.; Shevtsova, L.A.; Rozhnov, A.M.,
Isomerisation of chlorobutenes,
Russ. J. Phys. Chem. (Engl. Transl.), 1975, 49, 41-43. [all data]