Butane, 2,3-dichloro-, (R*,R*)-(.+/-.)-
- Formula: C4H8Cl2
- Molecular weight: 127.012
- IUPAC Standard InChIKey: RMISVOPUIFJTEO-IMJSIDKUSA-N
- CAS Registry Number: 2211-67-8
- Chemical structure:
View 3d structure (requires JavaScript / HTML 5) - Species with the same structure:
- Stereoisomers:
- Other names: Butane, 2,3-dichloro-, (.+/-.)-; (.+/-.)-2,3-Dichlorobutane; DL-2,3-Dichlorobutane; racemic-2,3-Dichlorobutane; threo-2,3-Dichlorobutane

Gas phase thermochemistry data

Data compiled by: Hussein Y. Afeefy, Joel F. Liebman, and Stephen E. Stein
Quantity | Value | Units | Method | Reference | Comment |
---|---|---|---|---|---|
ΔfH°gas | -202.2 ± 1.7 | kJ/mol | Ccb | He, An, et al., 1993 |

Condensed phase thermochemistry data

Data compiled by: Hussein Y. Afeefy, Joel F. Liebman, and Stephen E. Stein
Quantity | Value | Units | Method | Reference | Comment |
---|---|---|---|---|---|
ΔfH°liquid | -241.9 ± 1.7 | kJ/mol | Ccb | He, An, et al., 1993 | |
Quantity | Value | Units | Method | Reference | Comment |
ΔcH°liquid | -2522.7 ± 1.7 | kJ/mol | Ccb | He, An, et al., 1993 |

Phase change data

Data compiled as indicated in comments:
AC - William E. Acree, Jr., James S. Chickos
ALS - Hussein Y. Afeefy, Joel F. Liebman, and Stephen E. Stein
Quantity | Value | Units | Method | Reference | Comment |
---|---|---|---|---|---|
ΔvapH° | 39.7 | kJ/mol | C | He, An, et al., 1993, 2 | AC |
ΔvapH° | 39.73 ± 0.05 | kJ/mol | V | He, An, et al., 1993 | ALS |

Reaction thermochemistry data

Data compiled by: Hussein Y. Afeefy, Joel F. Liebman, and Stephen E. Stein
Individual Reactions
By formula: C4H8Cl2 = C4H8Cl2
Quantity | Value | Units | Method | Reference | Comment |
---|---|---|---|---|---|
ΔrH° | -1.13 ± 0.21 | kJ/mol | Eqk | Pavskii, Batarova, et al., 1971 | gas phase |

References

He, An, et al., 1993
He, J.; An, X.-W.; Hu, R.-H.,
Measurements of enthalpies of formation of 2,3-dichlorobutane in gaseous state,
Acta Chim. Sin., 1993, 51, 1059-1065. [all data]
He, An, et al., 1993, 2
He, J.; An, X.; Hu, R.,
Measurements of enthalpies of formation of 2,3-dichlorobutane in gaseous state,
Huaxue Xuebao, 1993, 51, 11, 1059. [all data]
Pavskii, Batarova, et al., 1971
Pavskii, V.I.; Batarova, N.I.; Rozhnov, A.M.,
Meso-dl-isomerization of 2,3-dichlorobutane,
Zh. Org. Khim., 1971, 7, 1325-1327. [all data]