2-Decen-1-ol
- Formula: C10H20O
- Molecular weight: 156.2652
- IUPAC Standard InChIKey: QOPYYRPCXHTOQZ-CMDGGOBGSA-N
- CAS Registry Number: 22104-80-9
- Chemical structure:
View 3d structure (requires JavaScript / HTML 5) - Species with the same structure:
- Stereoisomers:
- Other names: Dec-2-en-1-ol; 2-Decenol; Dec-2-enol

Normal alkane RI, polar column, custom temperature program

Column type | Active phase | I | Reference | Comment |
---|---|---|---|---|
Capillary | DB-Wax | 1812. | Welke, Manfroi, et al., 2012 | 30. m/0.25 mm/0.25 μm, Helium; Program: not specified |
Capillary | Carbowax 20M | 1794. | Bais, Dattatreya, et al., 2003 | He; Program: not specified |
Capillary | Carbowax 20M | 1806. | Bais, Dattatreya, et al., 2003 | He; Program: not specified |

References

Welke, Manfroi, et al., 2012
Welke, J.E.; Manfroi, V.; Zanus, M.; Lazarotto, M.; Zini, C.A.,
Characterization of the volatile profile of Brazilian merlot wines through comprehensive two dimensional gas chromatography time-of-flight mass spectrometric detection,
J. Chromatogr. A, 2012, 1226, 124-139, https://doi.org/10.1016/j.chroma.2012.01.002
. [all data]
Bais, Dattatreya, et al., 2003
Bais, H.P.; Dattatreya, B.S.; Ravishankar, G.A.,
Production of volatile compounds by hairy root cultures of Cichorium intybus L under the influence of fungal elicitors and their analysis using solid-phase micro extraction gas chromatography-mass spectrometry,
J. Sci. Food Agric., 2003, 83, 8, 769-774, https://doi.org/10.1002/jsfa.1378
. [all data]