2H-Azepin-2-one, hexahydro-5-methyl-
- Formula: C7H13NO
- Molecular weight: 127.1842
- IUPAC Standard InChIKey: BXYQVGFHMYTNBX-UHFFFAOYSA-N
- CAS Registry Number: 2210-07-3
- Chemical structure:
View 3d structure (requires JavaScript / HTML 5) - Other names: γ-Methyl-ε-caprolactam; γ-Methylcaprolactam; 5-Methylcaprolactam; Hexahydro-5-methyl-2H-azepin-2-one

Condensed phase thermochemistry data

Data compiled by: Hussein Y. Afeefy, Joel F. Liebman, and Stephen E. Stein
Quantity | Value | Units | Method | Reference | Comment |
---|---|---|---|---|---|
ΔcH°solid | -4248.4 ± 1.3 | kJ/mol | Ccb | Strepikeev, Skuratov, et al., 1955 | Reanalyzed by Cox and Pilcher, 1970, Original value = -4249.7 kJ/mol |

References

Strepikeev, Skuratov, et al., 1955
Strepikeev, A.A.; Skuratov, S.M.; Kachinskaya, O.N.; Muromova, R.S.; Brikina, E.P.; Shtekhter, S.M.,
About the tension of cycle in lactames,
Dokl. Akad. Nauk SSSR, 1955, 102, 105-108. [all data]
Cox and Pilcher, 1970
Cox, J.D.; Pilcher, G.,
Thermochemistry of Organic and Organometallic Compounds, Academic Press, New York, 1970, 1-636. [all data]