(iPr)2BF
- Formula: C6H14BF2
- Molecular weight: 134.983
- CAS Registry Number: 22086-63-1

Reaction thermochemistry data

Data compiled by: John E. Bartmess
Individual Reactions
By formula: F- + C6H14BF2 = (F- • C6H14BF2)
Quantity | Value | Units | Method | Reference | Comment |
---|---|---|---|---|---|
ΔrH° | 66.50 | kcal/mol | IMRB | Murphy and Beauchamp, 1977 | gas phase; Fluoride Affinity: SiF4>iPr2BF>iPr3B |

Ion clustering data

Data compiled by: John E. Bartmess
Clustering reactions
By formula: F- + C6H14BF2 = (F- • C6H14BF2)
Quantity | Value | Units | Method | Reference | Comment |
---|---|---|---|---|---|
ΔrH° | 66.50 | kcal/mol | IMRB | Murphy and Beauchamp, 1977 | gas phase; Fluoride Affinity: SiF4>iPr2BF>iPr3B |

References

Murphy and Beauchamp, 1977
Murphy, M.K.; Beauchamp, J.L.,
Fluorine and Alkyl Substituent Effects on Gas-Phase Lewis Acidities of Boranes by ICR Spectroscopy,
Inorg. Chem., 1977, 16, 2437. [all data]