1,3-Cyclopentadiene, 1,2,3,4-tetrachloro-5,5-dimethoxy-
- Formula: C7H6Cl4O2
- Molecular weight: 263.933
- IUPAC Standard InChIKey: UHSMEJQTFMHABA-UHFFFAOYSA-N
- CAS Registry Number: 2207-27-4
- Chemical structure:
View 3d structure (requires JavaScript / HTML 5) - Other names: 5,5-Dimethoxy-1,2,3,4-tetrachlorocyclopentadiene; 2,4-Cyclopentadien-1-one, 2,3,4,5-tetrachloro-, dimethyl acetal; 1,2,3,4-Tetrachloro-5,5-dimethoxycyclopentadiene; 5,5-Dimethoxytetrachlorocyclopentadiene; Tetrachlorocyclopentadienone dimethyl acetal; 2,3,4,5-Tetrachlorocyclopentadienone dimethyl acetal; 2,3,4,5-Tetrachloro-1,1-dimethoxycyclopentadiene; Tetrachlorocyclopentadienone dimethyl ketal; 1,1-Dimethoxy-2,3,4,5-tetrachlorocyclopentadiene; Cyclopentadienone, tetrachloro-, dimethyl acetal; 1, 2, 3, 4-Tetrachloro-5, 5-dimethoxy-1,3-cyclopentadiene; 1,2,3,4-tetrachloro-5,5-dimethoxycyclopenta-1,3-diene

Phase change data

Data compiled by: Robert L. Brown and Stephen E. Stein
Reduced pressure boiling point
Tboil (K) | Pressure (bar) | Reference |
---|---|---|
382.2 | 0.015 | Aldrich Chemical Company Inc., 1990 |
352. to 364. | 0.0008 | Frinton Laboratories Inc., 1986 |

References

Aldrich Chemical Company Inc., 1990
Aldrich Chemical Company Inc.,
Catalog Handbook of Fine Chemicals, Aldrich Chemical Company, Inc., Milwaukee WI, 1990, 1. [all data]
Frinton Laboratories Inc., 1986
Frinton Laboratories Inc.,
Catalog Number 11, Frinton Laboratories Inc., Vineland, NJ, 1986, 99. [all data]