Dichlone anion
- Formula: C10H4Cl2O2-
- Molecular weight: 227.044
- CAS Registry Number: 22062-59-5

Reaction thermochemistry data

Data compiled as indicated in comments:
B - John E. Bartmess
M - Michael M. Meot-Ner (Mautner) and Sharon G. Lias
Individual Reactions
C10H4Cl2O2- + = (C10H4Cl2O2- •
)
By formula: C10H4Cl2O2- + CH4O = (C10H4Cl2O2- • CH4O)
Quantity | Value | Units | Method | Reference | Comment |
---|---|---|---|---|---|
ΔrG° | <1.5 ± 1.6 | kcal/mol | IMRE | Chowdhury, Grimsrud, et al., 1987 | gas phase; Free energy affinity at 70°C.; B |
Free energy of reaction
ΔrG° (kcal/mol) | T (K) | Method | Reference | Comment |
---|---|---|---|---|
1.5 | 343. | PHPMS | Chowdhury, 1987 | gas phase; DG<; M |
C10H4Cl2O2- + = (C10H4Cl2O2- •
)
By formula: C10H4Cl2O2- + C2H3N = (C10H4Cl2O2- • C2H3N)
Quantity | Value | Units | Method | Reference | Comment |
---|---|---|---|---|---|
ΔrG° | <1.5 ± 1.6 | kcal/mol | IMRE | Chowdhury, Grimsrud, et al., 1987 | gas phase; Free energy affinity at 70°C.; B |
Free energy of reaction
ΔrG° (kcal/mol) | T (K) | Method | Reference | Comment |
---|---|---|---|---|
1.5 | 343. | PHPMS | Chowdhury, 1987 | gas phase; DG<; M |

Ion clustering data

Data compiled as indicated in comments:
B - John E. Bartmess
M - Michael M. Meot-Ner (Mautner) and Sharon G. Lias
Clustering reactions
C10H4Cl2O2- + = (C10H4Cl2O2- •
)
By formula: C10H4Cl2O2- + CH4O = (C10H4Cl2O2- • CH4O)
Quantity | Value | Units | Method | Reference | Comment |
---|---|---|---|---|---|
ΔrG° | <1.5 ± 1.6 | kcal/mol | IMRE | Chowdhury, Grimsrud, et al., 1987 | gas phase; Free energy affinity at 70°C.; B |
Free energy of reaction
ΔrG° (kcal/mol) | T (K) | Method | Reference | Comment |
---|---|---|---|---|
1.5 | 343. | PHPMS | Chowdhury, 1987 | gas phase; DG<; M |
C10H4Cl2O2- + = (C10H4Cl2O2- •
)
By formula: C10H4Cl2O2- + C2H3N = (C10H4Cl2O2- • C2H3N)
Quantity | Value | Units | Method | Reference | Comment |
---|---|---|---|---|---|
ΔrG° | <1.5 ± 1.6 | kcal/mol | IMRE | Chowdhury, Grimsrud, et al., 1987 | gas phase; Free energy affinity at 70°C.; B |
Free energy of reaction
ΔrG° (kcal/mol) | T (K) | Method | Reference | Comment |
---|---|---|---|---|
1.5 | 343. | PHPMS | Chowdhury, 1987 | gas phase; DG<; M |

Gas phase thermochemistry data

Data compiled by: John E. Bartmess

Quantity Value Units Method Reference Comment
Δfgas-86.9 ± 3.8kcal/molR-EAHeinis, Chowdhury, et al., 1988ΔGea(423 K) = 49.4 kcal/mol; ΔSea = -3.5 eu

References

Chowdhury, Grimsrud, et al., 1987
Chowdhury, S.; Grimsrud, E.P.; Kebarle, P.,
Bonding of Charged Delocalized Anions to Protic and Dipolar Aprotic Solvent Molecules,
J. Phys. Chem., 1987, 91, 10, 2551, https://doi.org/10.1021/j100294a021
. [all data]
Chowdhury, 1987
Chowdhury, S. Grimsrud,
Bonding of Charge Delocalized Anions to Protic and Dipolar Aprotic Solvents,
J. Phys. Chem., 1987, 91, 10, 2551, https://doi.org/10.1021/j100294a021
. [all data]