1-Butene, 3-bromo-
- Formula: C4H7Br
- Molecular weight: 135.002
- IUPAC Standard InChIKey: XOTGLEGIDHZTIM-UHFFFAOYSA-N
- CAS Registry Number: 22037-73-6
- Chemical structure:
View 3d structure (requires JavaScript / HTML 5) - Other names: 3-Bromo-1-butene

Reaction thermochemistry data

Data compiled by: Hussein Y. Afeefy, Joel F. Liebman, and Stephen E. Stein
Individual Reactions
By formula: C4H7Br = C4H7Br
Quantity | Value | Units | Method | Reference | Comment |
---|---|---|---|---|---|
ΔrH° | -4.0 ± 0.54 | kJ/mol | Eqk | Shishinova, Levanova, et al., 1978 | gas phase; UV Irradiation |
ΔrH° | -4.0 ± 0.54 | kJ/mol | Eqk | Shishinova, Levanova, et al., 1977 | gas phase |
By formula: C4H7Br = C4H7Br
Quantity | Value | Units | Method | Reference | Comment |
---|---|---|---|---|---|
ΔrH° | 12. ± 0.59 | kJ/mol | Eqk | Shishinova, Levanova, et al., 1978 | gas phase; UV Irradiation |
ΔrH° | 12. ± 0.59 | kJ/mol | Eqk | Shishinova, Levanova, et al., 1977 | gas phase |

References

Shishinova, Levanova, et al., 1978
Shishinova, V.I.; Levanova, S.V.; Shevtsova, L.A.; Rozhnov, A.M.; Kudryavtsev, V.A.,
Thermodynamic functions of bromobutenes,
Russ. J. Phys. Chem. (Engl. Transl.), 1978, 52, 270-271. [all data]
Shishinova, Levanova, et al., 1977
Shishinova, V.I.; Levanova, S.V.; Shevtsova, L.A.; Rozhnov, A.M.; Kudryavtsev, V.A.,
Thermodynamic functions of bromobutenes,
Deposited Doc., 1977, 1-6. [all data]