N-Allyl-2-pyridone
- Formula: C8H9NO
- Molecular weight: 135.1632
- IUPAC Standard InChIKey: QXLAXTADFRGVIS-UHFFFAOYSA-N
- CAS Registry Number: 21997-30-8
- Chemical structure:
View 3d structure (requires JavaScript / HTML 5) - Other names: 1-Allyl-2(1h)-pyridinone

Phase change data

Data compiled by: Robert L. Brown and Stephen E. Stein
Reduced pressure boiling point
Tboil (K) | Pressure (bar) | Reference |
---|---|---|
366. to 370. | 0.020 | Frinton Laboratories Inc., 1986 |

References

Frinton Laboratories Inc., 1986
Frinton Laboratories Inc.,
Catalog Number 11, Frinton Laboratories Inc., Vineland, NJ, 1986, 99. [all data]