4-Heptanol, 4-propyl-
- Formula: C10H22O
- Molecular weight: 158.2811
- IUPAC Standard InChIKey: SJTPBRMACCDJPZ-UHFFFAOYSA-N
- CAS Registry Number: 2198-72-3
- Chemical structure:
View 3d structure (requires JavaScript / HTML 5) - Other names: 4-Propyl-4-heptanol

Condensed phase thermochemistry data

Data compiled by: Eugene S. Domalski and Elizabeth D. Hearing
Constant pressure heat capacity of liquid
Cp,liquid (J/mol*K) | Temperature (K) | Reference |
---|---|---|
446.60 | 298.15 | Caceres-Alonso, Costas, et al., 1988 |

Phase change data

Data compiled by: Thermodynamics Research Center, NIST Boulder Laboratories, Chris Muzny director
Quantity | Value | Units | Method | Reference | Comment |
---|---|---|---|---|---|
Tboil | 467.15 | K | N/A | Meshcheryakov, Erzyutova, et al., 1961 | Uncertainty assigned by TRC = 4. K |
Tboil | 465.15 | K | N/A | Leroide, 1921 | Uncertainty assigned by TRC = 4. K |

References

Caceres-Alonso, Costas, et al., 1988
Caceres-Alonso, M.; Costas, M.; Andreoli-Ball, L.; Patterson, D.,
Steric effects on the self-association of branched and cyclic alcohols in inert solvents. Apparent heat capacities of secondary and tertiary alcohols in hydrocarbons,
Can. J. Chem., 1988, 66, 989-998. [all data]
Meshcheryakov, Erzyutova, et al., 1961
Meshcheryakov, A.P.; Erzyutova, E.I.; Kuo, Chun-I,
Izv. Akad. Nauk SSSR, 1961, 1961, 2198. [all data]
Leroide, 1921
Leroide, J.,
Ann. Chim. (Paris), 1921, 16, 354. [all data]