4,4,7,7-Tetramethylcyclodecyne

Reaction thermochemistry data

Data compiled by: Hussein Y. Afeefy, Joel F. Liebman, and Stephen E. Stein

Individual Reactions

2Hydrogen + 4,4,7,7-Tetramethylcyclodecyne = 1,1,4,4-Tetramethyl-cyclodecane

By formula: 2H2 + C14H24 = C14H28

Quantity Value Units Method Reference Comment
Δr-258.kJ/molChydSicher, Svoboda, et al., 1966liquid phase; solvent: Acetic acid

References

Sicher, Svoboda, et al., 1966
Sicher, J.; Svoboda, M.; Zavada, J.; Turner, R.B.; Goebel, P., Sterochemical studies - XXXVI. An approach to conformational analysis of medium ring compounds. Unsaturated ten-membered ring derivates, Tetrahedron, 1966, 22, 659-671. [all data]