2-Butene, 1,1-dimethoxy-
- Formula: C6H12O2
- Molecular weight: 116.1583
- IUPAC Standard InChIKey: NOYRGONWBIVLEL-SNAWJCMRSA-N
- CAS Registry Number: 21962-24-3
- Chemical structure:
View 3d structure (requires JavaScript / HTML 5) - Other names: Crotonaldehyde, dimethyl acetal; 2-Butenal dimethyl acetal; 1,1-dimethoxybut-2-ene

Gas phase thermochemistry data

Data compiled by: Hussein Y. Afeefy, Joel F. Liebman, and Stephen E. Stein
Quantity | Value | Units | Method | Reference | Comment |
---|---|---|---|---|---|
ΔfH°gas | -303. ± 2. | kJ/mol | Cm | Wiberg, Morgan, et al., 1994 |

Condensed phase thermochemistry data

Data compiled by: Hussein Y. Afeefy, Joel F. Liebman, and Stephen E. Stein
Quantity | Value | Units | Method | Reference | Comment |
---|---|---|---|---|---|
ΔfH°liquid | -346. ± 2. | kJ/mol | Cm | Wiberg, Morgan, et al., 1994 |

Phase change data

Data compiled as indicated in comments:
ALS - Hussein Y. Afeefy, Joel F. Liebman, and Stephen E. Stein
DRB - Donald R. Burgess, Jr.
Quantity | Value | Units | Method | Reference | Comment |
---|---|---|---|---|---|
ΔvapH° | 43.26 | kJ/mol | V | Wiberg, Morgan, et al., 1994 | ALS |
ΔvapH° | 43.0 | kJ/mol | N/A | Wiberg, Morgan, et al., 1994 | DRB |

Reaction thermochemistry data

Data compiled by: Hussein Y. Afeefy, Joel F. Liebman, and Stephen E. Stein
Individual Reactions
By formula: C6H12O2 + H2O = C4H6O + 2CH4O
Quantity | Value | Units | Method | Reference | Comment |
---|---|---|---|---|---|
ΔrH° | 15.3 ± 0.2 | kJ/mol | Cm | Wiberg, Morgan, et al., 1994 | liquid phase |

References

Wiberg, Morgan, et al., 1994
Wiberg, K.B.; Morgan, K.M.; Maltz, H.,
Thermochemistry of carbonyl reactions. 6. A study of hydration equilibria,
J. Am. Chem. Soc., 1994, 116, 11067-11077. [all data]