Dimethylchlorogermane

Phase change data

Data compiled by: William E. Acree, Jr., James S. Chickos

Enthalpy of vaporization

ΔvapH (kJ/mol) Temperature (K) Reference Comment
29.4280.Amberger and Boeters, 1961Based on data from 273. - 288. K.

References

Amberger and Boeters, 1961
Amberger, E.; Boeters, H., Darstellung der Methylchlorgermane, Angew. Chem., 1961, 73, 3, 114-114, https://doi.org/10.1002/ange.19610730309 . [all data]