Piperidine, 1-heptyl
- Formula: C12H25N
- Molecular weight: 183.3336
- IUPAC Standard InChIKey: PBCPROXTVFVOBC-UHFFFAOYSA-N
- CAS Registry Number: 21928-43-8
- Chemical structure:
View 3d structure (requires JavaScript / HTML 5) - Other names: N-heptylpiperidine

Phase change data

Data compiled by: Thermodynamics Research Center, NIST Boulder Laboratories, Chris Muzny director
Quantity | Value | Units | Method | Reference | Comment |
---|---|---|---|---|---|
Tboil | 512.65 | K | N/A | Magnusson and Schierz, 1940 | Uncertainty assigned by TRC = 0.5 K |

References

Magnusson and Schierz, 1940
Magnusson, H.W.; Schierz, E.R.,
A Study of SOme Physical Constants of N-n-Alkylpiperidines,
Univ. Wyo. Publ., 1940, 7, 1. [all data]