Phenanthro(2,1-b)thiophene
- Formula: C16H10S
- Molecular weight: 234.316
- IUPAC Standard InChIKey: WYAKNOROQVZSDA-UHFFFAOYSA-N
- CAS Registry Number: 219-25-0
- Chemical structure:
View 3d structure (requires JavaScript / HTML 5) - Permanent link for this species. Use this link for bookmarking this species for future reference.

Lee's RI, non-polar column, temperature ramp

Column type | Active phase | I | Reference | Comment |
---|---|---|---|---|
Capillary | Rxi-5 MS | 400.75 | Zeigler, Schantz, et al., 2012 | 30. m/0.25 mm/0.25 μm, Helium, 60. C @ 1. min, 5. K/min, 340. C @ 0. min |
Capillary | HP-5 MS | 400.75 | zu Reckendorf, 2003 | 25. m/0.25 mm/0.33 μm, 5. K/min; Tstart: 70. C; Tend: 320. C |
Capillary | SE-52 | 399.58 | Kong, Lee, et al., 1982 | H2, 8. K/min; Column length: 19.6 m; Column diameter: 0.32 mm; Tstart: 40. C; Tend: 280. C |
Capillary | SE-52 | 400.59 | Vassilaros, Kong, et al., 1982 | 20. m/0.30 mm/0.25 μm, H2, 40. C @ 2. min, 4. K/min; Tend: 265. C |

References

Zeigler, Schantz, et al., 2012
Zeigler, C.; Schantz, M.; Wise, S.; Robbat, A.,
Mass spectra and retention indices for polycyclic aromatic sulfur heterocycles and some alkylated analogs,
Polycyclic Aromatic Compounds, 2012, 32, 2, 154-176, https://doi.org/10.1080/10406638.2011.651679
. [all data]
zu Reckendorf, 2003
zu Reckendorf, R.M.,
Pattern change of several polycyclic aromatic furans and analogous thiophenes on oxidative pyrolysis of pitches in flue gases, and the relevance to their quantitative analysis,
Chromatographia, 2003, 58, 1/2, 103-113. [all data]
Kong, Lee, et al., 1982
Kong, R.C.; Lee, M.L.; Tominaga, Y.; Pratap, R.; Iwao, M.; Castle, R.N.; Wise, S.A.,
Capillary Column Gas Chromatographic Resolution of Isomeric Polycylic Aromatic Sulfur Heterocycles in a Coal Liquid,
J. Chromatogr. Sci., 1982, 20, 11, 502-510, https://doi.org/10.1093/chromsci/20.11.502
. [all data]
Vassilaros, Kong, et al., 1982
Vassilaros, D.L.; Kong, R.C.; Later, D.W.; Lee, M.L.,
Linear retention index system for polycyclic aromatic compounds. Critical evaluation and additional indices,
J. Chromatogr., 1982, 252, 1-20, https://doi.org/10.1016/S0021-9673(01)88394-1
. [all data]