mercury monoxide
- Formula: HgO
- Molecular weight: 216.59
- IUPAC Standard InChIKey: UKWHYYKOEPRTIC-UHFFFAOYSA-N
- CAS Registry Number: 21908-53-2
- Chemical structure:
View 3d structure (requires JavaScript / HTML 5) - Other names: Mercury(ii) oxide

Gas phase thermochemistry data

Quantity | Value | Units | Method | Reference | Comment |
---|---|---|---|---|---|
ΔfH°gas | 41.84 | kJ/mol | Review | Chase, 1998 | Data last reviewed in June, 1962 |
Quantity | Value | Units | Method | Reference | Comment |
S°gas,1 bar | 239.13 | J/mol*K | Review | Chase, 1998 | Data last reviewed in June, 1962 |
Gas Phase Heat Capacity (Shomate Equation)
Cp° = A + B*t + C*t2 + D*t3 +
E/t2
H° − H°298.15= A*t + B*t2/2 +
C*t3/3 + D*t4/4 − E/t + F − H
S° = A*ln(t) + B*t + C*t2/2 + D*t3/3 −
E/(2*t2) + G
Cp = heat capacity (J/mol*K)
H° = standard enthalpy (kJ/mol)
S° = standard entropy (J/mol*K)
t = temperature (K) / 1000.
View plot Requires a JavaScript / HTML 5 canvas capable browser.
Temperature (K) | 298. to 6000. |
---|---|
A | 36.41988 |
B | 1.285167 |
C | -0.226380 |
D | 0.019250 |
E | -0.360147 |
F | 29.71904 |
G | 280.8029 |
H | 41.84000 |
Reference | Chase, 1998 |
Comment | Data last reviewed in June, 1962 |

Condensed phase thermochemistry data

Quantity | Value | Units | Method | Reference | Comment |
---|---|---|---|---|---|
ΔfH°solid | -90.79 ± 0.12 | kJ/mol | Review | Cox, Wagman, et al., 1984 | red phase; CODATA Review value |
ΔfH°solid | -90.79 | kJ/mol | Review | Chase, 1998 | Data last reviewed in June, 1962 |
Quantity | Value | Units | Method | Reference | Comment |
S°solid,1 bar | 70.25 ± 0.30 | J/mol*K | Review | Cox, Wagman, et al., 1984 | red phase; CODATA Review value |
Quantity | Value | Units | Method | Reference | Comment |
S°solid | 70.26 | J/mol*K | Review | Chase, 1998 | Data last reviewed in June, 1962 |
Solid Phase Heat Capacity (Shomate Equation)
Cp° = A + B*t + C*t2 + D*t3 +
E/t2
H° − H°298.15= A*t + B*t2/2 +
C*t3/3 + D*t4/4 − E/t + F − H
S° = A*ln(t) + B*t + C*t2/2 + D*t3/3 −
E/(2*t2) + G
Cp = heat capacity (J/mol*K)
H° = standard enthalpy (kJ/mol)
S° = standard entropy (J/mol*K)
t = temperature (K) / 1000.
View plot Requires a JavaScript / HTML 5 canvas capable browser.
Temperature (K) | 298. to 1000. |
---|---|
A | 27.60273 |
B | 73.55556 |
C | -58.49650 |
D | 16.82299 |
E | -0.064122 |
F | -102.0222 |
G | 83.82811 |
H | -90.78903 |
Reference | Chase, 1998 |
Comment | Data last reviewed in June, 1962 |

Constants of diatomic molecules

Data compiled by: Klaus P. Huber and Gerhard H. Herzberg
Data collected through February, 1975
Symbol | Meaning |
---|---|
State | electronic state and / or symmetry symbol |
Te | minimum electronic energy (cm-1) |
ωe | vibrational constant – first term (cm-1) |
ωexe | vibrational constant – second term (cm-1) |
ωeye | vibrational constant – third term (cm-1) |
Be | rotational constant in equilibrium position (cm-1) |
αe | rotational constant – first term (cm-1) |
γe | rotation-vibration interaction constant (cm-1) |
De | centrifugal distortion constant (cm-1) |
βe | rotational constant – first term, centrifugal force (cm-1) |
re | internuclear distance (Å) |
Trans. | observed transition(s) corresponding to electronic state |
ν00 | position of 0-0 band (units noted in table) |
State | Te | ωe | ωexe | ωeye | Be | αe | γe | De | βe | re | Trans. | ν00 |
---|---|---|---|---|---|---|---|---|---|---|---|---|
Absorption bands in the region 33900 - 36500 cm-1, usually ascribed to Hg2 ("wing" bands), were tentatively assigned to HgO by Walter and Barratt, 1929. |

References

Chase, 1998
Chase, M.W., Jr.,
NIST-JANAF Themochemical Tables, Fourth Edition,
J. Phys. Chem. Ref. Data, Monograph 9, 1998, 1-1951. [all data]
Cox, Wagman, et al., 1984
Cox, J.D.; Wagman, D.D.; Medvedev, V.A.,
CODATA Key Values for Thermodynamics, Hemisphere Publishing Corp., New York, 1984, 1. [all data]
Walter and Barratt, 1929
Walter, J.M.; Barratt, S.,
The band spectra associated with zinc, cadmium, and mercury,
Proc. R. Soc. London A, 1929, 122, 201. [all data]