3-Methyl-3-chloro-1-butene
- Formula: C5H9Cl
- Molecular weight: 104.578
- IUPAC Standard InChIKey: KECJPTAJLDCQHM-UHFFFAOYSA-N
- CAS Registry Number: 2190-48-9
- Chemical structure:
View 3d structure (requires JavaScript / HTML 5) - Other names: 3-Chloro-3-methyl-1-butene; 1-Butene, 3-methyl-3-chloro

Normal alkane RI, non-polar column, temperature ramp

Column type | Active phase | I | Reference | Comment |
---|---|---|---|---|
Capillary | OV-101 | 642. | Zenkevich, 2005 | 25. m/0.20 mm/0.10 μm, N2/He, 6. K/min; Tstart: 50. C; Tend: 250. C |

References

Zenkevich, 2005
Zenkevich, I.G.,
Experimentally measured retention indices., 2005. [all data]