piperazine, 1-propyl-
- Formula: C7H16N2
- Molecular weight: 128.2153
- IUPAC Standard InChIKey: QLEIDMAURCRVCX-UHFFFAOYSA-N
- CAS Registry Number: 21867-64-1
- Chemical structure:
View 3d structure (requires JavaScript / HTML 5) - Permanent link for this species. Use this link for bookmarking this species for future reference.

Phase change data

Data compiled by: Thermodynamics Research Center, NIST Boulder Laboratories, Chris Muzny director
Quantity | Value | Units | Method | Reference | Comment |
---|---|---|---|---|---|
Tboil | 440.15 | K | N/A | Anderson and Shimanskaya, 1969 | Uncertainty assigned by TRC = 2. K |

References

Anderson and Shimanskaya, 1969
Anderson, A.A.; Shimanskaya, M.V.,
Gas-Liquid Chromatography of some Aliphatic and Heterocyclic Polyfunctional Amines: II. Solution Thermodyn. of Amines in Fix. Phas.,
Latv. PSR Zinat. Akad. Vestis, Kim. Ser., 1969, No. 5, 527. [all data]