2-Cyclopenten-1-one, 3-ethyl-2-hydroxy-
- Formula: C7H10O2
- Molecular weight: 126.1531
- IUPAC Standard InChIKey: JHWFWLUAUPZUCP-UHFFFAOYSA-N
- CAS Registry Number: 21835-01-8
- Chemical structure:
View 3d structure (requires JavaScript / HTML 5) - Other names: 3-Ethyl-2-hydroxy-2-cyclopenten-1-one; 2-Cyclopenten-1-one, 2-hydroxy-3-ethyl; 2-Hydroxy-3-ethyl-2-cyclopenten-1-one; 3-Ethyl-2-hydroxy-2-cyclopentenone; 3-Ethyl-2-hydroxycyclopent-2-en-1-one; 3-Ethyl-2-hydroxycyclopenten-1-one

Van Den Dool and Kratz RI, non-polar column, temperature ramp

Column type | Active phase | I | Reference | Comment |
---|---|---|---|---|
Capillary | OV-101 | 1100. | Mihara and Nishimura, 1989 | N2, 2. K/min; Column length: 50. m; Column diameter: 0.22 mm; Tstart: 80. C; Tend: 200. C |

Van Den Dool and Kratz RI, non-polar column, custom temperature program

Column type | Active phase | I | Reference | Comment |
---|---|---|---|---|
Capillary | DB-5MS | 1140. | Varlet, Serot, et al., 2007 | 30. m/0.32 mm/0.5 μm, He; Program: 70C => 5C/min => 85C(1min) => 3C/min => 165C => 10C/min => 280C(3min) |

Van Den Dool and Kratz RI, polar column, temperature ramp

Column type | Active phase | I | Reference | Comment |
---|---|---|---|---|
Capillary | CP-WAX 57CB | 1891. | Baltes and Mevissen, 1988 | He, 50. C @ 5. min, 2. K/min; Column length: 50. m; Column diameter: 0.24 mm; Tend: 210. C |

Normal alkane RI, non-polar column, temperature ramp

Column type | Active phase | I | Reference | Comment |
---|---|---|---|---|
Capillary | OV-101 | 1100. | Nishimura and Mihara, 1990 | N2, 2. K/min; Column length: 50. m; Column diameter: 0.23 mm; Tstart: 80. C; Tend: 200. C |

Normal alkane RI, non-polar column, custom temperature program

Column type | Active phase | I | Reference | Comment |
---|---|---|---|---|
Capillary | DB-5 | 1082. | Yu and Zhang, 2010 | 30. m/0.25 mm/0.25 μm; Program: 40 0C (5 min) 5 0C/min -> 260 0C 15 0C/min -> 280 0C (1 min) |
Capillary | ZB-5 | 1091. | de Simon, Estruelas, et al., 2009 | 30. m/0.25 mm/0.25 μm, Helium; Program: 45 0C 3 0C/min -> 230 0C (10 min) 10 0C/min -> 270 0C (21 min) |

Normal alkane RI, polar column, temperature ramp

Column type | Active phase | I | Reference | Comment |
---|---|---|---|---|
Capillary | HP-FFAP | 1926. | Wanakhachornkrai and Lertsiri, 9999 | 25. m/0.32 mm/0.50 μm, Helium, 15. K/min; Tstart: 45. C; Tend: 220. C |
Capillary | DB-Wax | 1924. | Moon and Shibamoto, 2009 | 60. m/0.25 mm/0.50 μm, Helium, 40. C @ 5. min, 2. K/min, 210. C @ 70. min |
Capillary | DB-Wax | 1845. | Fujioka and Shibamoto, 2006 | 60. m/0.25 mm/0.25 μm, He, 2. K/min, 200. C @ 90. min; Tstart: 50. C |
Capillary | HP-FFAP | 1926. | Wanakhachornkrai and Lertsiri, 2003 | 25. m/0.32 mm/0.5 μm, He, 15. K/min; Tstart: 45. C; Tend: 220. C |

Normal alkane RI, polar column, custom temperature program

Column type | Active phase | I | Reference | Comment |
---|---|---|---|---|
Capillary | DB-Wax | 1894. | Gonzalez-Rios, Suarez-Quiroz, et al., 2007 | 30. m/0.25 mm/0.25 μm, Hydrogen; Program: 44 0C 3 0C/min -> 170 0C 8 0C/min -> 250 0C |
Capillary | HP-Innowax | 1910. | Viegas and Bassoli, 2007 | 60. m/0.32 mm/0.25 μm, Helium; Program: 40 0C (5 min) 4 0C/min -> 60 0C (5 min) 8 0C/min -> 250 0C (3 min) |
Capillary | Carbowax | 1892. | Baltes and Bochmann, 1987 | Program: not specified |
Capillary | Carbowax | 1893. | Baltes and Bochmann, 1987 | Program: not specified |
Capillary | Carbowax | 1893. | Baltes and Bochmann, 1987 | Program: not specified |
Capillary | Carbowax | 1894. | Baltes and Bochmann, 1987 | Program: not specified |

References

Mihara and Nishimura, 1989
Mihara, S.; Nishimura, O.,
Retention indices of 2-hydroxy-2-cyclopenten-1-ones,
J. Hi. Res. Chromatogr., 1989, 12, 11, 763-764, https://doi.org/10.1002/jhrc.1240121116
. [all data]
Varlet, Serot, et al., 2007
Varlet, V.; Serot, T.; Cardinal, M.; Knockaert, C.; Prost, C.,
Olfactometric Determination of the Most Potent Odor-Active Compounds in Salmon Muscle (Salmo salar) Smoked by Using Four Smoke Generation Techniques,
J. Agric. Food Chem., 2007, 55, 11, 4518-4525, https://doi.org/10.1021/jf063468f
. [all data]
Baltes and Mevissen, 1988
Baltes, W.; Mevissen, L.,
Model reactions on roast aroma formation. VI. Volatile reaction products from the reaction of phenylalanine with glucose during cooking and roasting,
Z. Lebensm. Unters. Forsch., 1988, 187, 3, 209-214, https://doi.org/10.1007/BF01043341
. [all data]
Nishimura and Mihara, 1990
Nishimura, O.; Mihara, S.,
Investigation of 2-hydroxy-2-cyclopenten-1-ones in roasted coffee,
J. Agric. Food Chem., 1990, 38, 4, 1038-1041, https://doi.org/10.1021/jf00094a027
. [all data]
Yu and Zhang, 2010
Yu, A.-N.; Zhang, A.-D.,
The effect of pH on the total formation of aroma compounds produced by hearting a model system containing L-ascorbic acid with L-threonine/L-serine,
Food Chem., 2010, 119, 1, 214-219, https://doi.org/10.1016/j.foodchem.2009.06.026
. [all data]
de Simon, Estruelas, et al., 2009
de Simon, B.F.; Estruelas, E.; Munoz, A.M.; Cadahia, E.; Sanz, M.,
Volatile compounds in acacia, chestnut, cherry, ash, and oak woods, with a view to their use in cooperage,
J. Agric. Food Chem., 2009, 57, 8, 3217-3227, https://doi.org/10.1021/jf803463h
. [all data]
Wanakhachornkrai and Lertsiri, 9999
Wanakhachornkrai, P.; Lertsiri, S.,
Comparison of determination method for volatile compounds in Thai soy sauce,
Analytical, Nutritional and Clinical Methods, 9999, 1-11. [all data]
Moon and Shibamoto, 2009
Moon, J.-K.; Shibamoto, T.,
Role of roasting conditions in the profile of volatile flavor chemicals formed from coffee beans,
J. Agric. Food Chem., 2009, 57, 13, 5823-5831, https://doi.org/10.1021/jf901136e
. [all data]
Fujioka and Shibamoto, 2006
Fujioka, K.; Shibamoto, T.,
Quantitation of volatiles and nonvolatile acids in an extract from coffee beverages: correlation with antioxidant activity,
J. Agric. Food Chem., 2006, 54, 16, 6054-6058, https://doi.org/10.1021/jf060460x
. [all data]
Wanakhachornkrai and Lertsiri, 2003
Wanakhachornkrai, P.; Lertsiri, S.,
Analytical, nutritional, and clinical methods. Comparison of determination method for volatile compounds in Thai soy sauce,
Food Chem., 2003, 83, 4, 619-629, https://doi.org/10.1016/S0308-8146(03)00256-5
. [all data]
Gonzalez-Rios, Suarez-Quiroz, et al., 2007
Gonzalez-Rios, O.; Suarez-Quiroz, M.L.; Boulanger, R.; Barel, M.; Guyot, B.; Guiraud, J.-P.; Schorr-Galindo, S.,
Impact of ecological post-harvest processing of coffee aroma: II Roasted coffee.,
J. Food Composition Analysis, 2007, 20, 3-4, 297-307, https://doi.org/10.1016/j.jfca.2006.12.004
. [all data]
Viegas and Bassoli, 2007
Viegas, M.C.; Bassoli, D.G.,
Utilizacao do indice de retencao linear para caracterizacao de compostos volateis em cafe soluvel utilizando GC-MS e coluna HP-Innowax,
Quim. Nova, 2007, 30, 8, 2031-2034, https://doi.org/10.1590/S0100-40422007000800040
. [all data]
Baltes and Bochmann, 1987
Baltes, W.; Bochmann, G.,
Model reactions on roast aroma formations, V. Mass spectrometric identification of pyrifines, oxazoles, and carbocyclic compounds from the reaction of serine and threonine with sucrose under the conditions of coffee roasting,
Z. Lebensm. Unters. Forsch., 1987, 185, 1, 5-9, https://doi.org/10.1007/BF01083331
. [all data]