bis(triphenyl germanium) oxide
- Formula: C36H30Ge2O
- Molecular weight: 623.90
- CAS Registry Number: 2181-40-0

Condensed phase thermochemistry data

Data compiled by: José A. Martinho Simões
Quantity | Value | Units | Method | Reference | Comment |
---|---|---|---|---|---|
ΔfH°solid | 161.1 ± 9.0 | kJ/mol | Review | Martinho Simões | |
Quantity | Value | Units | Method | Reference | Comment |
ΔcH°solid | -19724.3 ± 7.4 | kJ/mol | CC-RB | Carson, Jamea, et al., 1988 |

Phase change data

Data compiled as indicated in comments:
MS - José A. Martinho Simões
AC - William E. Acree, Jr., James S. Chickos
Quantity | Value | Units | Method | Reference | Comment |
---|---|---|---|---|---|
ΔsubH° | 98.0 ± 1.5 | kJ/mol | CC-RB | Carson, Jamea, et al., 1988 | MS |
ΔsubH° | 98.0 ± 1.5 | kJ/mol | ME,TE | Carson, Jamea, et al., 1988, 2 | AC |

Gas phase thermochemistry data

Data compiled by: José A. Martinho Simões
Quantity | Value | Units | Method | Reference | Comment |
---|---|---|---|---|---|
ΔfH°gas | 61.9 ± 2.2 | kcal/mol | Review | Martinho Simões |

References

Martinho Simões
Martinho Simões, J.A.,
Private communication (see http://webbook.nist.gov/chemistry/om/). [all data]
Carson, Jamea, et al., 1988
Carson, A.S.; Jamea, E.H.; Laye, P.G.; Spencer, J.A.,
J. Chem. Thermodyn., 1988, 20, 1223. [all data]
Carson, Jamea, et al., 1988, 2
Carson, A.S.; Jamea, E.H.; Laye, P.G.; Spencer, J.A.,
The enthalpies of formation of triphenyl vinyl germanium, triphenyl phenylethynyl germanium, bis(triphenyl germanium) oxide, and some associated Ge«58872»C bond enthalpies,
The Journal of Chemical Thermodynamics, 1988, 20, 10, 1223-1229, https://doi.org/10.1016/0021-9614(88)90107-3
. [all data]