Cis-1-cyano-1,3-butadiene
- Formula: C5H5N
- Molecular weight: 79.0999
- IUPAC Standard InChIKey: STSRVFAXSLNLLI-ONEGZZNKSA-N
- CAS Registry Number: 2180-69-0
- Chemical structure:
View 3d structure (requires JavaScript / HTML 5) - Species with the same structure:
- Stereoisomers:
- Other names: cis 2,4-pentadienenitrile (cis 1-cyano-1,3-butadiene)

Phase change data

Data compiled as indicated in comments:
TRC - Thermodynamics Research Center, NIST Boulder Laboratories, Chris Muzny director
AC - William E. Acree, Jr., James S. Chickos
Quantity | Value | Units | Method | Reference | Comment |
---|---|---|---|---|---|
Tfus | 210.57 | K | N/A | Wise, 1954 | Uncertainty assigned by TRC = 0.1 K; TRC |
Enthalpy of vaporization
ΔvapH (kJ/mol) | Temperature (K) | Method | Reference | Comment |
---|---|---|---|---|
41.4 | 333. | A | Stephenson and Malanowski, 1987 | Based on data from 318. to 383. K. See also Dykyj, 1972.; AC |
40.7 | 348. | N/A | Wise, 1954, 2 | AC |
38.3 | 408. | N/A | Wise, 1954, 2 | AC |

References

Wise, 1954
Wise, K.V.,
Physical Properties of cis-1-Cyano-1,3-butadiene,
J. Am. Chem. Soc., 1954, 76, 3094. [all data]
Stephenson and Malanowski, 1987
Stephenson, Richard M.; Malanowski, Stanislaw,
Handbook of the Thermodynamics of Organic Compounds, 1987, https://doi.org/10.1007/978-94-009-3173-2
. [all data]
Dykyj, 1972
Dykyj, J.,
Petrochemia, 1972, 12, 1, 13. [all data]
Wise, 1954, 2
Wise, K.V.,
Physical Properties of cis-1-Cyano-1,3-butadiene,
J. Am. Chem. Soc., 1954, 76, 11, 3094-3096, https://doi.org/10.1021/ja01640a084
. [all data]