Diallyl disulphide
- Formula: C6H10S2
- Molecular weight: 146.274
- IUPAC Standard InChIKey: PFRGXCVKLLPLIP-UHFFFAOYSA-N
- CAS Registry Number: 2179-57-9
- Chemical structure:
View 3d structure (requires JavaScript / HTML 5) - Other names: Allyl disulfide; Diallyl disulfide; Disulfide, di-2-propenyl; Allyl disulphide; 4,5-Dithia-1,7-octadiene; 2-Propenyl disulphide; di-2-Propenyl disulfide; di-Propenyl disulfide; 1,2-Diallyldisulfane; 3-(Allyldisulfanyl)-1-propene; dipropenyldisulfide (diallyl disulfide)

Phase change data

Data compiled by: Robert L. Brown and Stephen E. Stein
Quantity | Value | Units | Method | Reference | Comment |
---|---|---|---|---|---|
Tboil | 460.7 | K | N/A | Aldrich Chemical Company Inc., 1990 |
Reduced pressure boiling point
Tboil (K) | Pressure (atm) | Reference |
---|---|---|
352.2 | 0.021 | Weast and Grasselli, 1989 |

Kovats' RI, non-polar column, isothermal

View large format table.

Column type Active phase Temperature (C) I Reference Comment
CapillaryOV-101130.1073.Misharina and Golovnya, 1989He; Column length: 50. m; Column diameter: 0.32 mm
PackedApiezon M130.1080.Garbuzov, Misharina, et al., 1985He or N2, Chromosorb W, AW-DMCS; Column length: 2.1 m

Kovats' RI, non-polar column, temperature ramp

View large format table.

Column type Active phase I Reference Comment
CapillarySE-541065.Zoghbi, Ramos, et al., 198430. m/0.25 mm/0.25 μm, He, 50. C @ 3. min, 4. K/min; Tend: 230. C

Van Den Dool and Kratz RI, non-polar column, temperature ramp

View large format table.

Column type Active phase I Reference Comment
CapillaryDB-51082.Mahattanatawee K., Perez-Cacho P.R., et al., 200730. m/0.32 mm/0.5 μm, He, 7. K/min, 265. C @ 5. min; Tstart: 40. C
CapillaryHP-5MS1077.Pino, Mesa, et al., 200530. m/0.25 mm/0.25 μm, He, 60. C @ 2. min, 4. K/min, 250. C @ 20. min
CapillaryDB-11056.Pino, Fuentes, et al., 2001He, 60. C @ 4. min, 4. K/min; Column length: 30. m; Column diameter: 0.32 mm; Tend: 250. C
CapillaryDB-51085.Kim, Wu, et al., 1995He, 40. C @ 10. min, 4. K/min; Column length: 60. m; Column diameter: 0.25 mm; Tend: 200. C
CapillaryDB-11078.Yu, Lin, et al., 199460. m/0.25 mm/1.0 μm, He, 40. C @ 5. min, 2. K/min, 260. C @ 60. min
CapillaryOV-1011064.Misharina and Golovnya, 1989He, 4. K/min; Column length: 50. m; Column diameter: 0.32 mm; Tstart: 50. C; Tend: 250. C

Van Den Dool and Kratz RI, non-polar column, custom temperature program

View large format table.

Column type Active phase I Reference Comment
CapillaryHP-5MS1088.Andriamaharavo, 201430. m/0.25 mm/0.25 μm, He; Program: 60C (1 min) => 5 C/min => 210C => 10 C/min => 280C (15 min)
CapillaryHP-5MS1083.Pérez, Navarro, et al., 200730. m/0.25 mm/0.25 μm, He; Program: 50C(4min) => 10C/min => 200C(0.5min) => 20C/min => 260C(5min)
CapillarySPB-11060.Mochizuki, Yamamoto, et al., 199830. m/0.32 mm/4.0 μm, N2; Program: 40 0C (10 min), 2 0C/min to 180 0C, 25 0C/min to 250 0C (5 min)

Van Den Dool and Kratz RI, polar column, temperature ramp

View large format table.

Column type Active phase I Reference Comment
CapillaryDB-Wax1463.Mahattanatawee K., Perez-Cacho P.R., et al., 200730. m/0.32 mm/0.5 μm, He, 7. K/min, 240. C @ 5. min; Tstart: 40. C
CapillaryFFAP1496.Calvo-Gómez, Morales-López, et al., 200430. m/0.25 mm/0.25 μm, He, 40. C @ 3. min, 5. K/min; Tend: 220. C
CapillaryHP-Innowax1526.Storsberg, Schulz, et al., 200460. m/0.25 mm/0.5 μm, H2, 10. K/min; Tstart: 35. C; Tend: 220. C
CapillaryCarbowax1490.Edris and Fadel, 2002He, 2. K/min; Column length: 60. m; Column diameter: 0.32 mm; Tstart: 50. C; Tend: 200. C
CapillaryCP-Wax 52CB1480.Kim, Wu, et al., 1995, 2N2, 60. C @ 4. min, 2. K/min, 200. C @ 30. min; Column length: 50. m; Column diameter: 0.25 mm
CapillaryCP-Wax 52CB1480.Kim, Wu, et al., 1995, 2N2, 60. C @ 4. min, 2. K/min, 200. C @ 30. min; Column length: 50. m; Column diameter: 0.25 mm
CapillaryDB-Wax1475.Shiratsuchi, Shimoda, et al., 199360. m/0.25 mm/0.25 μm, 50. C @ 4. min, 2. K/min, 230. C @ 30. min
CapillaryCP-Wax 52CB1441.Yu, Wu, et al., 199350. m/0.32 mm/0.25 μm, H2, 40. C @ 10. min, 1.5 K/min, 200. C @ 60. min
CapillaryCP-Wax 52CB1490.Yu, Wu, et al., 1989N2, 2. K/min; Column length: 50. m; Column diameter: 0.22 mm; Tstart: 50. C; Tend: 200. C
CapillaryCP-Wax 52CB1490.Yu, Wu, et al., 1989, 2N2, 2. K/min; Column length: 50. m; Column diameter: 0.22 mm; Tstart: 50. C; Tend: 200. C
CapillaryCP-Wax 52CB1490.Yu and Wu, 1989N2, 2. K/min; Column length: 50. m; Column diameter: 0.22 mm; Tstart: 50. C; Tend: 200. C

Normal alkane RI, non-polar column, temperature ramp

View large format table.

Column type Active phase I Reference Comment
Capillary5 % Phenyl methyl siloxane1085.Ramirez R. and Cava R., 200730. m/0.25 mm/1. μm, He, 40. C @ 10. min, 7. K/min, 250. C @ 5. min
CapillarySPB-11054.Rao, Nagender, et al., 200730. m/0.32 mm/0.25 μm, Helium, 40. C @ 2. min, 2. K/min; Tend: 220. C
CapillaryRSL-2001048.Jirovetz, Ngassoum, et al., 200230. m/0.32 mm/0.25 μm, H2, 50. C @ 5. min, 6. K/min, 280. C @ 5. min
CapillaryDB-5MS1080.Zoghbi, Andrade, et al., 200230. m/0.25 mm/0.25 μm, He, 3. K/min; Tstart: 60. C; Tend: 270. C
CapillaryDB-51087.Meynier, Novelli, et al., 199930. m/0.32 mm/1. μm, 40. C @ 5. min, 3. K/min; Tend: 200. C
CapillaryHP-51079.Kubec, Velísek, et al., 199730. m/0.25 mm/0.25 μm, N2, 40. C @ 3. min, 4. K/min, 240. C @ 10. min
CapillaryHP-11050.Lopes, Godoy, et al., 199725. m/0.32 mm/0.17 μm, H2, 5. K/min; Tstart: 40. C; Tend: 200. C
CapillaryDB-11072.Yu, Wu, et al., 199460. m/0.25 mm/1.0 μm, He, 40. C @ 5. min, 2. K/min, 260. C @ 60. min
CapillaryDB-11075.Yu, Wu, et al., 1994, 260. m/0.25 mm/1. μm, He, 40. C @ 5. min, 2. K/min, 260. C @ 60. min
CapillaryDB-11073.Yu, Wu, et al., 1994, 360. m/0.25 mm/1. μm, He, 40. C @ 5. min, 2. K/min, 260. C @ 60. min

Normal alkane RI, non-polar column, custom temperature program

View large format table.

Column type Active phase I Reference Comment
CapillaryHP-51088.Rotsatschakul, Visesanguan, et al., 200960. m/0.25 mm/0.25 μm, Helium; Program: 30 0C (2 min) 2 0Cmin -> 60 0C 10 0C/min -> 100 0C 20 0C/min -> 140 0C 10 0C/min -> 200 0C (10 min)
CapillarySPB-11069.Rao, Nagender, et al., 200730. m/0.32 mm/0.25 μm, Helium; Program: not specified
CapillaryHP-5 MS1071.Pyun and Shin, 200630. m/0.25 mm/0.25 μm; Program: 40 0C (3 min) 2 0C/min -> 150 0C 20 0C/min -> 220 0C (5 min)
CapillarySE-301064.Vinogradov, 2004Program: not specified
CapillaryHP-5MS1076.Ansorena, Gimeno, et al., 200130. m/0.25 mm/0.25 μm, He; Program: 40C (10min) => 3C/min => 120C => 10C/min => 250C (5min)
CapillaryHP-51075.Ansorena, Astiasarán, et al., 200030. m/0.25 mm/0.25 μm, He; Program: 40C (10min) => 3C/min => 120C => 10C/min => 250C (5min)
CapillaryCP Sil 5 CB1071.Gijs, Piraprez, et al., 200050. m/0.32 mm/1.2 μm, He; Program: 33C (16.5min) => 2C/min => 160C => 20C/min => 200C (9min)
CapillaryDB-51095.Mateo and Zumalacárregui, 199650. m/0.32 mm/0.25 μm, He; Program: 40C (10min) => 3C/min => 95C => 10C/min => 270C (10min)
CapillaryDB-51096.Mateo and Zumalacárregui, 199650. m/0.32 mm/0.25 μm, He; Program: 40C (10min) => 3C/min => 95C => 10C/min => 270C (10min)
CapillaryDB-51090.Mateo and Zumalacárregui, 199650. m/0.32 mm/0.25 μm, He; Program: 40C (10min) => 3C/min => 95C => 10C/min => 270C (10min)

Normal alkane RI, polar column, temperature ramp

View large format table.

Column type Active phase I Reference Comment
CapillaryDB-Wax1465.Fu, Yoon, et al., 200230. m/0.25 mm/0.25 μm, He, 40. C @ 5. min, 8. K/min, 250. C @ 5. min
CapillaryDB-Wax1465.Chyau and Mau, 199960. m/0.25 mm/0.25 μm, N2, 3. K/min; Tstart: 40. C; Tend: 210. C
CapillaryDB-Wax1470.Chyau and Mau, 199960. m/0.25 mm/0.25 μm, N2, 3. K/min; Tstart: 40. C; Tend: 210. C
CapillaryDB-Wax1468.Chen and Ho, 1998He, 4. K/min; Column length: 30. m; Column diameter: 0.25 mm; Tstart: 50. C; Tend: 220. C
CapillaryHP-Innowax1500.Kubec, Velísek, et al., 199730. m/0.25 mm/0.5 μm, N2, 40. C @ 3. min, 4. K/min; Tend: 190. C
CapillaryDB-Wax1475.Shimoda, Shiratsuchi, et al., 199360. m/0.25 mm/0.25 μm, He, 50. C @ 4. min, 2. K/min; Tend: 230. C

Normal alkane RI, polar column, custom temperature program

View large format table.

Column type Active phase I Reference Comment
CapillaryCarbowax 20M1436.Vernin, Lageot, et al., 1998Program: not specified
CapillaryCarbowax 20M1436.Vernin, Lageot, et al., 1998Program: not specified

References

Aldrich Chemical Company Inc., 1990
Aldrich Chemical Company Inc.,
Catalog Handbook of Fine Chemicals, Aldrich Chemical Company, Inc., Milwaukee WI, 1990, 1. [all data]
Weast and Grasselli, 1989
CRC Handbook of Data on Organic Compounds, 2nd Editon, Weast,R.C and Grasselli, J.G., ed(s)., CRC Press, Inc., Boca Raton, FL, 1989, 1. [all data]