2,4-Dimethylbenzonitrile
- Formula: C9H9N
- Molecular weight: 131.1745
- IUPAC Standard InChIKey: QLZDTHTXOUOSCV-UHFFFAOYSA-N
- CAS Registry Number: 21789-36-6
- Chemical structure:
View 3d structure (requires JavaScript / HTML 5) - Other names: Benzonitrile, 2,4-dimethyl-; 2,6-Dimethylbenzonitrile

Phase change data

Data compiled as indicated in comments:
TRC - Thermodynamics Research Center, NIST Boulder Laboratories, Chris Muzny director
AC - William E. Acree, Jr., James S. Chickos
Quantity | Value | Units | Method | Reference | Comment |
---|---|---|---|---|---|
Tfus | 297.1 | K | N/A | Birch, Dean, et al., 1949 | Uncertainty assigned by TRC = 1. K; TRC |
Quantity | Value | Units | Method | Reference | Comment |
ΔsubH° | 83.9 ± 2.8 | kJ/mol | C | Acree, Tucker, et al., 1991 | AC |

References

Birch, Dean, et al., 1949
Birch, S.F.; Dean, R.A.; Fidler, F.A.; Lowry, R.A.,
The preparation of the c(10) monocyclic aromatic hydrocarbons,
J. Am. Chem. Soc., 1949, 71, 1362. [all data]
Acree, Tucker, et al., 1991
Acree, W.E., Jr.; Tucker, S.A.; Zvaigzne, A.I.; Meng-Yan, Y.; Pilcher, G.; Ribeiro Da Silva, M.D.M.,
Enthalpies of combustion of 2,4,6-trimethylbenzonitrile, 2,4,6-trimethylbenzonitrile N-oxide,, 2,6-dimethylbenzonitrile, 2,4,6-trimethoxybenzonitrile, and 2,4,6-trimethoxybenzonitrile N-oxide: the dissociation enthalpies of the (N-O) bonds,
J. Chem. Thermodyn., 1991, 23, 31-36. [all data]