methyl 3-methylnonanoate
- Formula: C11H22O2
- Molecular weight: 186.2912
- IUPAC Standard InChIKey: XANGOCPHPGWYJI-UHFFFAOYSA-N
- CAS Registry Number: 2177-87-9
- Chemical structure:
View 3d structure (requires JavaScript / HTML 5) - Permanent link for this species. Use this link for bookmarking this species for future reference.

Phase change data

Data compiled by: Thermodynamics Research Center, NIST Boulder Laboratories, Chris Muzny director
Quantity | Value | Units | Method | Reference | Comment |
---|---|---|---|---|---|
Tboil | 374.15 | K | N/A | Schulte, Krause, et al., 1951 | Uncertainty assigned by TRC = 1. K |

References

Schulte, Krause, et al., 1951
Schulte, K.E.; Krause, H.; Kirschner, J.,
Z. Physiol. Chem., 1951, 287, 239. [all data]