2-Propenoic acid, ethenyl ester
- Formula: C5H6O2
- Molecular weight: 98.0999
- IUPAC Standard InChIKey: BLCTWBJQROOONQ-UHFFFAOYSA-N
- CAS Registry Number: 2177-18-6
- Chemical structure:
View 3d structure (requires JavaScript / HTML 5) - Other names: Acrylic acid, vinyl ester; Vinyl acrylate

Phase change data

Data compiled by: Thermodynamics Research Center, NIST Boulder Laboratories, Chris Muzny director
Quantity | Value | Units | Method | Reference | Comment |
---|---|---|---|---|---|
Tfus | 191.2 | K | N/A | Anonymous, 1957 | Uncertainty assigned by TRC = 0.6 K |

References

Anonymous, 1957
Anonymous, R.,
, Am. Pet. Inst. Res. Proj. 6, Carnegie-Mellon Univ., 1957. [all data]