Pentanoic acid, pentyl ester
- Formula: C10H20O2
- Molecular weight: 172.2646
- IUPAC Standard InChIKey: FGPPDYNPZTUNIU-UHFFFAOYSA-N
- CAS Registry Number: 2173-56-0
- Chemical structure:
View 3d structure (requires JavaScript / HTML 5) - Other names: Valeric acid, pentyl ester; Amyl valerate; Amyl valerianate; Pentyl pentanoate; Pentyl valerate; 1-Pentyl n-valerate; n-Pentyl valerate; Pentyl ester of pentanoic acid; n-Amyl n-valerate; NSC 76414

Phase change data

Data compiled by: Thermodynamics Research Center, NIST Boulder Laboratories, Chris Muzny director
Quantity | Value | Units | Method | Reference | Comment |
---|---|---|---|---|---|
Tboil | 479. | K | N/A | Gill and Dexter, 1934 | Uncertainty assigned by TRC = 4. K |
Tboil | 476.9 | K | N/A | Gartenmeister, 1886 | Uncertainty assigned by TRC = 2. K |

Kovats' RI, non-polar column, isothermal

Column type | Active phase | Temperature (C) | I | Reference | Comment |
---|---|---|---|---|---|
Packed | SE-30 | 150. | 1155. | Ashes and Haken, 1974 | Celaton (62-72 mesh); Column length: 3.7 m |
Packed | SE-30 | 100. | 1173. | Chastrette, Heintz, et al., 1974 | N2, Chromosorb W AW (60-80 mesh); Column length: 3. m |
Packed | SE-30 | 150. | 1170. | Germaine and Haken, 1969 | Celite 560; Column length: 3.7 m |

Kovats' RI, non-polar column, custom temperature program

Column type | Active phase | I | Reference | Comment |
---|---|---|---|---|
Capillary | SE-30 | 1155. | Chretien and Dubois, 1978 | Program: not specified |

Kovats' RI, polar column, isothermal

Column type | Active phase | Temperature (C) | I | Reference | Comment |
---|---|---|---|---|---|
Packed | Carbowax 20M | 100. | 1406. | Chastrette, Heintz, et al., 1974 | Chromosorb WAW (60-80 mesh); Column length: 3. m |

Normal alkane RI, non-polar column, temperature ramp

Column type | Active phase | I | Reference | Comment |
---|---|---|---|---|
Capillary | OV-101 | 1175. | Zenkevich, Eliseenkov, et al., 2011 | 25. m/0.20 mm/0.25 μm, Nitrogen, 6. K/min; Tstart: 40. C; Tend: 220. C |
Capillary | OV-101 | 1188. | Zenkevich, Eliseenkov, et al., 2011 | 25. m/0.20 mm/0.25 μm, Nitrogen, 6. K/min; Tstart: 40. C; Tend: 220. C |
Capillary | HP-5 MS | 1150. | Forero, Quijano, et al., 2008 | 30. m/0.25 mm/0.25 μm, Helium, 50. C @ 4. min, 4. K/min, 230. C @ 10. min |
Capillary | OV-101 | 1185. | Egolf and Jurs, 1993 | 2. K/min; Column length: 50. m; Column diameter: 0.22 mm; Tstart: 80. C; Tend: 200. C |
Capillary | OV-101 | 1185. | Anker, Jurs, et al., 1990 | 2. K/min; Column length: 50. m; Column diameter: 0.28 mm; Tstart: 80. C; Tend: 200. C |

Normal alkane RI, non-polar column, custom temperature program

Column type | Active phase | I | Reference | Comment |
---|---|---|---|---|
Capillary | SE-30 | 1155. | Liu, Liang, et al., 2007 | Program: not specified |
Capillary | SE-30 | 1185. | Vinogradov, 2004 | Program: not specified |

Normal alkane RI, polar column, temperature ramp

Column type | Active phase | I | Reference | Comment |
---|---|---|---|---|
Capillary | Carbowax 20M | 1401. | Egolf and Jurs, 1993 | 2. K/min; Column length: 80. m; Column diameter: 0.2 mm; Tstart: 70. C; Tend: 170. C |
Capillary | Carbowax 20M | 1401. | Anker, Jurs, et al., 1990 | 2. K/min; Column length: 80. m; Column diameter: 0.2 mm; Tstart: 70. C; Tend: 170. C |

Normal alkane RI, polar column, custom temperature program

Column type | Active phase | I | Reference | Comment |
---|---|---|---|---|
Capillary | Carbowax 20M | 1401. | Vinogradov, 2004 | Program: not specified |

References

Gill and Dexter, 1934
Gill, A.H.; Dexter, F.P.,
Ind. Eng. Chem., 1934, 26, 881. [all data]
Gartenmeister, 1886
Gartenmeister, R.,
Investigation of the physical characterstics of liquid compounds: vi boiling point and specific volume of normal fatty acid esters,
Justus Liebigs Ann. Chem., 1886, 233, 249-315. [all data]
Ashes and Haken, 1974
Ashes, J.R.; Haken, J.K.,
Gas chromatography of homologous esters. VI. Structure-retention increments of aliphatic esters,
J. Chromatogr., 1974, 101, 1, 103-123, https://doi.org/10.1016/S0021-9673(01)94737-5
. [all data]
Chastrette, Heintz, et al., 1974
Chastrette, M.; Heintz, M.; Druilhe, A.; Lefort, D.,
Analyse chromatographique d'esters aliphatiques saturés. Relations rétention-structure et prévision de la rétention,
Bull. Soc. Chim. Fr., 1974, 9/10,Pt.1, 1852-1856. [all data]
Germaine and Haken, 1969
Germaine, R.W.; Haken, J.K.,
Gas chromatography of homologous esters. Part 1. Simple aliphatic esters,
J. Chromatogr., 1969, 43, 33-42, https://doi.org/10.1016/S0021-9673(00)99162-3
. [all data]
Chretien and Dubois, 1978
Chretien, J.R.; Dubois, J-E.,
Topological Analysis: A Technique for the Physico-Chemical Exploitation of Retention Data in Gas-Liquid Chromatography,
J. Chromatogr., 1978, 158, 43-56, https://doi.org/10.1016/S0021-9673(00)89954-9
. [all data]
Zenkevich, Eliseenkov, et al., 2011
Zenkevich, I.G.; Eliseenkov, E.V.; Kasatochkin, A.N.; Ukolov, A.I.,
Identification of the products of nonregioselective organic reactions by chromatography - mass spectrometry: chloro derivatives of dialkyl ethers,
Rus. J. Anal. Chem., 2011, 66, 14, 1445-1454, https://doi.org/10.1134/S1061934811140218
. [all data]
Forero, Quijano, et al., 2008
Forero, M.D.; Quijano, C.E.; Pino, J.A.,
Volatile compounds of Chile pepper (Capsicum annuum L. var. glabriusculum) at two ripening stages,
Flavour Fragr. J., 2008, 24, 1, 25-30, https://doi.org/10.1002/ffj.1913
. [all data]
Egolf and Jurs, 1993
Egolf, L.M.; Jurs, P.C.,
Quantitative structure-retention and structure-odor intensity relationships for a diverse group of odor-active compounds,
Anal. Chem., 1993, 65, 21, 3119-3126, https://doi.org/10.1021/ac00069a027
. [all data]
Anker, Jurs, et al., 1990
Anker, L.S.; Jurs, P.C.; Edwards, P.A.,
Quantitative structure-retention relationship studies of odor-active aliphatic compounds with oxygen-containing functional groups,
Anal. Chem., 1990, 62, 24, 2676-2684, https://doi.org/10.1021/ac00223a006
. [all data]
Liu, Liang, et al., 2007
Liu, F.; Liang, Y.; Cao, C.; Zhou, N.,
QSPR study of GC retention indices for saturated esters on seven stationary phases based on novel topological indices,
Talanta, 2007, 72, 4, 1307-1315, https://doi.org/10.1016/j.talanta.2007.01.038
. [all data]
Vinogradov, 2004
Vinogradov, B.A.,
Production, composition, properties and application of essential oils, 2004, retrieved from http://viness.narod.ru. [all data]