Fluometuron
- Formula: C10H11F3N2O
- Molecular weight: 232.2023
- IUPAC Standard InChIKey: RZILCCPWPBTYDO-UHFFFAOYSA-N
- CAS Registry Number: 2164-17-2
- Chemical structure:
View 3d structure (requires JavaScript / HTML 5) - Other names: Urea, N,N-dimethyl-N'-[3-(trifluoromethyl)phenyl]-; Urea, 1,1-dimethyl-3-(α,α,α-trifluoro-m-tolyl)-; C 2059; Ciba 2059; Cotoran; Kotoran; Lanex; N-(m-Trifluoromethylphenyl)-N',N'-dimethylurea; N-(3-Trifluoromethylphenyl)-N',N'-dimethylurea; Pakhtaran; 3-(m-Trifluoromethylphenyl)-1,1-dimethylurea; 3-(3-Trifluoromethylphenyl)-1,1-dimethylurea; 1,1-Dimethyl-3-(3-trifluoromethylphenyl)urea; Cottonex; Cotoran multi 50wp; 1,1-Dimethyl-3-(α,α,α-trifluoro-m-tolyl) urea; Herbicide C-2059; Higalcoton; NCI-C08695; 3-(5-Trifluormethylphenyl)-1,1-dimethylharnstoff

Phase change data

Data compiled as indicated in comments:
TRC - Thermodynamics Research Center, NIST Boulder Laboratories, Chris Muzny director
AC - William E. Acree, Jr., James S. Chickos
Quantity | Value | Units | Method | Reference | Comment |
---|---|---|---|---|---|
Tfus | 434.80 | K | N/A | Donnelly, Drewes, et al., 1990 | Uncertainty assigned by TRC = 0.2 K; TRC |
Tfus | 434.0 | K | N/A | Plato, 1972 | Uncertainty assigned by TRC = 0.2 K; TRC |
Enthalpy of fusion
ΔfusH (kJ/mol) | Temperature (K) | Method | Reference | Comment |
---|---|---|---|---|
29.82 | 434.1 | DSC | Acree, 1991 | See also Donnelly, Drewes, et al., 1990, 2.; AC |

Reaction thermochemistry data

Data compiled by: Hussein Y. Afeefy, Joel F. Liebman, and Stephen E. Stein
Individual Reactions
By formula: C10H11F3N2O = C2H7N + C8H4F3NO
Quantity | Value | Units | Method | Reference | Comment |
---|---|---|---|---|---|
ΔrH° | 152.1 ± 2.8 | kJ/mol | Eqk | Chimishkyan, Svetlova, et al., 1984 | solid phase; Dissociation |

References

Donnelly, Drewes, et al., 1990
Donnelly, J.R.; Drewes, L.A.; Johnson, R.L.; Munslow, W.D.; Knapp, K.K.; Sovocool, G.W.,
Purity and heat of fusion data for environmental standards as determined by differential scanning calorimetry,
Thermochim. Acta, 1990, 167, 2, 155, https://doi.org/10.1016/0040-6031(90)80476-F
. [all data]
Plato, 1972
Plato, C.,
DSC as a general method for determining purity and heat of fusion of high-purity organic chemicals,
Anal. Chem., 1972, 44, 1531. [all data]
Acree, 1991
Acree, William E.,
Thermodynamic properties of organic compounds: enthalpy of fusion and melting point temperature compilation,
Thermochimica Acta, 1991, 189, 1, 37-56, https://doi.org/10.1016/0040-6031(91)87098-H
. [all data]
Donnelly, Drewes, et al., 1990, 2
Donnelly, J.R.; Drewes, L.A.; Johnson, R.L.; Munslow, W.D.; Knapp, K.K.; Sovocool, G.W.,
Purity and heat of fusion data for environmental standards as determined by differential scanning calorimetry,
Thermochimica Acta, 1990, 167, 2, 155-187, https://doi.org/10.1016/0040-6031(90)80476-F
. [all data]
Chimishkyan, Svetlova, et al., 1984
Chimishkyan, A.L.; Svetlova, L.P.; Leonova, T.V.; Gluyaev, N.D.,
Thermal decomposition of substituted ureas,
J. Gen. Chem. USSR, 1984, 54, 1317-1320. [all data]