2-Propenamide, N-(3,4-dichlorophenyl)-2-methyl-
- Formula: C10H9Cl2NO
- Molecular weight: 230.091
- IUPAC Standard InChIKey: VCBRBUKGTWLJOB-UHFFFAOYSA-N
- CAS Registry Number: 2164-09-2
- Chemical structure:
View 3d structure (requires JavaScript / HTML 5) - Other names: Acrylanilide, 3',4'-dichloro-2-methyl-; Dicryl; DCMA; Methacrylic Acid 3,4-dichloroanilide; N 4,556; N-(3,4-Dichlorophenyl)Methacrylamide; Niagara 4556; 3',4'-Dichloro-2-methylacrylanilide; Chloranocryl; 3,4-Dichloranilid kyseliny methakrylove; 3',4'-Dichloro-2-methacrylanilide; N-(3,4-Dichlorophenyl)-2-methyl-2-propenamide; FMC 4556; α-Methylacrylic acid, 3,4-dichloroanilide; NIA 4556; Licryl

Phase change data

Data compiled as indicated in comments:
TRC - Thermodynamics Research Center, NIST Boulder Laboratories, Chris Muzny director
AC - William E. Acree, Jr., James S. Chickos
Quantity | Value | Units | Method | Reference | Comment |
---|---|---|---|---|---|
Tfus | 396.06 | K | N/A | Donnelly, Drewes, et al., 1990 | Uncertainty assigned by TRC = 0.2 K; TRC |
Tfus | 395.7 | K | N/A | Plato and Glasgow, 1969 | Uncertainty assigned by TRC = 0.2 K; TRC |
Enthalpy of fusion
ΔfusH (kJ/mol) | Temperature (K) | Method | Reference | Comment |
---|---|---|---|---|
32.04 | 395.5 | DSC | Acree, 1991 | See also Donnelly, Drewes, et al., 1990, 2.; AC |

References

Donnelly, Drewes, et al., 1990
Donnelly, J.R.; Drewes, L.A.; Johnson, R.L.; Munslow, W.D.; Knapp, K.K.; Sovocool, G.W.,
Purity and heat of fusion data for environmental standards as determined by differential scanning calorimetry,
Thermochim. Acta, 1990, 167, 2, 155, https://doi.org/10.1016/0040-6031(90)80476-F
. [all data]
Plato and Glasgow, 1969
Plato, C.; Glasgow, A.R., Jr.,
Differential scanning calorimetry as a general method for determining the purity and heat of fusion of high-purity organic chemicals. Application to 95 compounds,
Anal. Chem., 1969, 41, 2, 330, https://doi.org/10.1021/ac60271a041
. [all data]
Acree, 1991
Acree, William E.,
Thermodynamic properties of organic compounds: enthalpy of fusion and melting point temperature compilation,
Thermochimica Acta, 1991, 189, 1, 37-56, https://doi.org/10.1016/0040-6031(91)87098-H
. [all data]
Donnelly, Drewes, et al., 1990, 2
Donnelly, J.R.; Drewes, L.A.; Johnson, R.L.; Munslow, W.D.; Knapp, K.K.; Sovocool, G.W.,
Purity and heat of fusion data for environmental standards as determined by differential scanning calorimetry,
Thermochimica Acta, 1990, 167, 2, 155-187, https://doi.org/10.1016/0040-6031(90)80476-F
. [all data]