Hexane, 1,6-dichloro-

Condensed phase thermochemistry data

Data compiled by: Eugene S. Domalski and Elizabeth D. Hearing

Constant pressure heat capacity of liquid

Cp,liquid (J/mol*K) Temperature (K) Reference
239.57298.15Lainez, Grolier, et al., 1985

Phase change data

Data compiled as indicated in comments:
BS - Robert L. Brown and Stephen E. Stein
AC - William E. Acree, Jr., James S. Chickos

Quantity Value Units Method Reference Comment
Tboil477.2KN/AWeast and Grasselli, 1989BS
Quantity Value Units Method Reference Comment
Δvap13.5kcal/molN/AVarushchenko, Loseva, et al., 1988Based on data from 380. - 480. K. See also Basarová and Svoboda, 1991.; AC

Reduced pressure boiling point

Tboil (K) Pressure (atm) Reference Comment
361.70.020Aldrich Chemical Company Inc., 1990BS
361.0.020Farchan Laboratories, 1990BS

Kovats' RI, polar column, isothermal

View large format table.

Column type Active phase Temperature (C) I Reference Comment
CapillaryPEG-20M90.1536.Morishita, Terashima, et al., 1983He; Column length: 75. m; Column diameter: 0.25 mm

References

Lainez, Grolier, et al., 1985
Lainez, A.; Grolier, J.-P.E.; Wilhelm, E., Excess molar heat capacity and excess molar volume of 1,6-dichlorohexane + n-octane, Thermochim. Acta, 1985, 91, 243-248. [all data]