diethylpentylamine
- Formula: C9H21N
- Molecular weight: 143.2697
- IUPAC Standard InChIKey: YZULHOOBWDXEOT-UHFFFAOYSA-N
- CAS Registry Number: 2162-91-6
- Chemical structure:

Phase change data

Data compiled by: Thermodynamics Research Center, NIST Boulder Laboratories, Chris Muzny director
Quantity | Value | Units | Method | Reference | Comment |
---|---|---|---|---|---|
Tboil | 429.65 | K | N/A | Gol'dfarb and Ibragimova, 1956 | Uncertainty assigned by TRC = 3. K |
Tboil | 428.15 | K | N/A | Prevost and Cerf de Mauny, 1943 | Uncertainty assigned by TRC = 3. K |
Tboil | 429.15 | K | N/A | Carothers, 1938 | Uncertainty assigned by TRC = 3. K |
Tboil | 429.15 | K | N/A | Coffman, 1935 | Uncertainty assigned by TRC = 3. K |

References

Gol'dfarb and Ibragimova, 1956
Gol'dfarb; Ibragimova,
Dokl. Akad. Nauk SSSR, 1956, 106, 469. [all data]
Prevost and Cerf de Mauny, 1943
Prevost, C.; Cerf de Mauny, H.,
C. R. Hebd. Seances Acad. Sci., 1943, 216, 771. [all data]
Carothers, 1938
Carothers, W.H.,
, 1938. [all data]
Coffman, 1935
Coffman, D.D.,
Acetylene Polymers and Theri Derivatives XXII. α-Dialkylamonomethyl- β-vinylacetylenes,
J. Am. Chem. Soc., 1935, 57, 1978. [all data]