2,2'-(tert-Butylimino)diethanol
- Formula: C8H19NO2
- Molecular weight: 161.2420
- IUPAC Standard InChIKey: XHJGXOOOMKCJPP-UHFFFAOYSA-N
- CAS Registry Number: 2160-93-2
- Chemical structure:
View 3d structure (requires JavaScript / HTML 5) - Other names: N-tert-Butyldiethanolamine; N-t-Butyldiethanolamine; tert-Butyldiethanolamine; N-tert-Butyl-2,2'-iminodiethanol; Ethanol, 2,2'-[(1,1-dimethylethyl)imino]bis-; 2,2-(tert-Butylimino)diethanol; 2,2'-[(1,1-dimethylethyl)imino]bisethanol

Phase change data

Data compiled by: Robert L. Brown and Stephen E. Stein
Reduced pressure boiling point
Tboil (K) | Pressure (bar) | Reference |
---|---|---|
431. to 434. | 0.029 | Frinton Laboratories Inc., 1986 |

References

Frinton Laboratories Inc., 1986
Frinton Laboratories Inc.,
Catalog Number 11, Frinton Laboratories Inc., Vineland, NJ, 1986, 99. [all data]