1,1,4-Trimethylcycloheptane
- Formula: C10H20
- Molecular weight: 140.2658
- IUPAC Standard InChIKey: GQJXBLQVJKRGPQ-UHFFFAOYSA-N
- CAS Registry Number: 2158-55-6
- Chemical structure:
View 3d structure (requires JavaScript / HTML 5) - Permanent link for this species. Use this link for bookmarking this species for future reference.

Gas phase thermochemistry data

Data compiled by: Hussein Y. Afeefy, Joel F. Liebman, and Stephen E. Stein
Quantity | Value | Units | Method | Reference | Comment |
---|---|---|---|---|---|
ΔfH°gas | -210.3 ± 1.9 | kJ/mol | Ccb | Luk'yanova and Kozina, 1995 |

Condensed phase thermochemistry data

Data compiled by: Hussein Y. Afeefy, Joel F. Liebman, and Stephen E. Stein
Quantity | Value | Units | Method | Reference | Comment |
---|---|---|---|---|---|
ΔfH°liquid | -255.9 ± 1.9 | kJ/mol | Ccb | Luk'yanova and Kozina, 1995 | |
Quantity | Value | Units | Method | Reference | Comment |
ΔcH°liquid | -6537.5 ± 1.3 | kJ/mol | Ccb | Luk'yanova and Kozina, 1995 | Corresponding ΔfHºliquid = -255.9 kJ/mol (simple calculation by NIST; no Washburn corrections) |

Phase change data

Data compiled as indicated in comments:
AC - William E. Acree, Jr., James S. Chickos
ALS - Hussein Y. Afeefy, Joel F. Liebman, and Stephen E. Stein
DRB - Donald R. Burgess, Jr.
Quantity | Value | Units | Method | Reference | Comment |
---|---|---|---|---|---|
ΔvapH° | 45.5 ± 0.2 | kJ/mol | C | Varushchenko, Pashchenko, et al., 1996 | Text in Ref. Varushchenko, Pashchenko, et al., 1996 states 1,1,4-trimethylcycloheptane; however, the molecular structure of 1,1,4-trimethylcyclohexane is given in the paper.; AC |
ΔvapH° | 45.56 ± 0.17 | kJ/mol | C | Luk'yanova and Kozina, 1995 | ALS |
ΔvapH° | 45.6 | kJ/mol | N/A | Luk'yanova and Kozina, 1995 | DRB |

References

Luk'yanova and Kozina, 1995
Luk'yanova, V.A.; Kozina, M.P.,
Enthalpy of formation of 1,1,4-trimethylcycloheptane,
Russ. J. Phys. Chem. (Engl. Transl.), 1995, 69, 1906-1907, In original 2094. [all data]
Varushchenko, Pashchenko, et al., 1996
Varushchenko, R.M.; Pashchenko, L.L.; Druzhinina, A.I.,
Enthalpies of vaporization of some mono- and polycyclic hydrocarbons,
Zh. Fiz. Khim., 1996, 70, 2, 228. [all data]