Pentane, 3,3-dichloro-
- Formula: C5H10Cl2
- Molecular weight: 141.039
- IUPAC Standard InChIKey: MOUDFOLIRVUWKC-UHFFFAOYSA-N
- CAS Registry Number: 21571-91-5
- Chemical structure:
View 3d structure (requires JavaScript / HTML 5) - Other names: 3,3-dichloropentane

Phase change data

Data compiled by: Thermodynamics Research Center, NIST Boulder Laboratories, Chris Muzny director
Quantity | Value | Units | Method | Reference | Comment |
---|---|---|---|---|---|
Tboil | 404. | K | N/A | Henne and DeWitt, 1948 | Uncertainty assigned by TRC = 8. K |

Kovats' RI, non-polar column, isothermal

Column type | Active phase | Temperature (C) | I | Reference | Comment |
---|---|---|---|---|---|
Capillary | Apiezon L | 90. | 857. | Morishita, Terashima, et al., 1983 | He; Column length: 45. m; Column diameter: 0.25 mm |

Kovats' RI, polar column, isothermal

Column type | Active phase | Temperature (C) | I | Reference | Comment |
---|---|---|---|---|---|
Capillary | PEG-20M | 90. | 1074. | Morishita, Terashima, et al., 1983 | He; Column length: 75. m; Column diameter: 0.25 mm |

Normal alkane RI, non-polar column, isothermal

Column type | Active phase | Temperature (C) | I | Reference | Comment |
---|---|---|---|---|---|
Capillary | Apiezon L | 130. | 857. | Arruda, Junkes, et al., 2008 |

Normal alkane RI, non-polar column, custom temperature program

Column type | Active phase | I | Reference | Comment |
---|---|---|---|---|
Capillary | Polydimethyl siloxanes | 820. | Zenkevich, 1998 | Program: not specified |

References

Henne and DeWitt, 1948
Henne, A.L.; DeWitt, E.G.,
Difluoromalonic Derivatives from Difluoropentane,
J. Am. Chem. Soc., 1948, 70, 1548. [all data]
Morishita, Terashima, et al., 1983
Morishita, F.; Terashima, Y.; Ichise, M.; Kojima, T.,
Prediction of retention indices from molecular structures of chlorinated alkanes,
J. Chromatogr. Sci., 1983, 21, 5, 209-213, https://doi.org/10.1093/chromsci/21.5.209
. [all data]
Arruda, Junkes, et al., 2008
Arruda, A.C.S.; Junkes, B. da.S.; Souza, E.S.; Yunes, R.A.; Heizen, V.E.F.,
Semi-Emlirical Topological Index to Predict Properties of Halogenated Aliphatic Compounds,
J. Chemometrics, 2008, 22, 3-4, 186-194, https://doi.org/10.1002/cem.1121
. [all data]
Zenkevich, 1998
Zenkevich, I.G.,
The Principle of Structural Analogy in the Calculation of Gas Chromatographic Retention Indices using Physico-Chemical Constants of Organic Compounds,
Zh. Anal. Khim. (Rus.), 1998, 53, 1, 43-49. [all data]