4-Heptanol, 2-methyl-
- Formula: C8H18O
- Molecular weight: 130.2279
- IUPAC Standard InChIKey: QXPLZEKPCGUWEM-UHFFFAOYSA-N
- CAS Registry Number: 21570-35-4
- Chemical structure:
View 3d structure (requires JavaScript / HTML 5) - Other names: 2-Methyl-4-heptanol; 6-Methyl-4-heptanol; 2-Methylheptanol-(4); 2-methylheptan-4-ol

Condensed phase thermochemistry data

Data compiled by: Eugene S. Domalski and Elizabeth D. Hearing
Constant pressure heat capacity of liquid
Cp,liquid (J/mol*K) | Temperature (K) | Reference | Comment |
---|---|---|---|
331.8 | 298.5 | Cline and Andrews, 1931 | T = 102 to 298 K. Value is unsmoothed experimental datum. |

Phase change data

Data compiled as indicated in comments:
TRC - Thermodynamics Research Center, NIST Boulder Laboratories, Chris Muzny director
AC - William E. Acree, Jr., James S. Chickos
Quantity | Value | Units | Method | Reference | Comment |
---|---|---|---|---|---|
Tboil | 439.45 | K | N/A | Dorough, Glass, et al., 1941 | Uncertainty assigned by TRC = 1. K; TRC |
Tboil | 433.65 | K | N/A | Henry, 1906 | Uncertainty assigned by TRC = 5. K; TRC |
Tboil | 433.15 | K | N/A | Muset, 1906 | Uncertainty assigned by TRC = 3. K; TRC |
Enthalpy of vaporization
ΔvapH (kJ/mol) | Temperature (K) | Method | Reference | Comment |
---|---|---|---|---|
54.8 | 363. | A | Stephenson and Malanowski, 1987 | Based on data from 348. to 440. K.; AC |
56.3 | 360. | N/A | Wilhoit and Zwolinski, 1973 | Based on data from 345. to 437. K.; AC |

References

Cline and Andrews, 1931
Cline, J.K.; Andrews, D.H.,
Thermal energy studies. III. The octanols,
J. Am. Chem. Soc., 1931, 53, 3668-3673. [all data]
Dorough, Glass, et al., 1941
Dorough, G.L.; Glass, H.B.; Gresham, T.L.; Malone, G.B.; Reid, E.E.,
Structure-property relationships in some isomeric octanols,
J. Am. Chem. Soc., 1941, 63, 3100. [all data]
Henry, 1906
Henry, L.,
C. R. Hebd. Seances Acad. Sci., 1906, 143, 102. [all data]
Muset, 1906
Muset, J.,
Bull. Cl. Sci., 1906, 1906, 775. [all data]
Stephenson and Malanowski, 1987
Stephenson, Richard M.; Malanowski, Stanislaw,
Handbook of the Thermodynamics of Organic Compounds, 1987, https://doi.org/10.1007/978-94-009-3173-2
. [all data]
Wilhoit and Zwolinski, 1973
Wilhoit, R.C.; Zwolinski, B.J.,
Physical and thermodynamic properties of aliphatic alcohols,
J. Phys. Chem. Ref. Data Suppl., 1973, 1, 2, 1. [all data]