1-Acetyl-1H-tetrazole
- Formula: C3H4N4O
- Molecular weight: 112.0901
- IUPAC Standard InChIKey: KMCGTSTVKNCNQQ-UHFFFAOYSA-N
- CAS Registry Number: 21565-41-3
- Chemical structure:
View 3d structure (requires JavaScript / HTML 5) - Permanent link for this species. Use this link for bookmarking this species for future reference.

Reaction thermochemistry data

Data compiled by: Hussein Y. Afeefy, Joel F. Liebman, and Stephen E. Stein
Individual Reactions
By formula: C3H4N4O + H2O = CH2N4 + C2H4O2
Quantity | Value | Units | Method | Reference | Comment |
---|---|---|---|---|---|
ΔrH° | -43.1 ± 0.4 | kJ/mol | Cm | Wadso, 1960 | solid phase; Heat of hydrolysis |
By formula: C3H4N4O + C6H7N = C8H9NO + CH2N4
Quantity | Value | Units | Method | Reference | Comment |
---|---|---|---|---|---|
ΔrH° | -84.6 ± 0.3 | kJ/mol | Cm | Wadso, 1962 | solid phase |

References

Wadso, 1960
Wadso, I.,
Heats of hydrolysis of N-acetylated imidazole, 1,2,4-triazole and tetrazole,
Acta Chem. Scand., 1960, 14, 903-908. [all data]
Wadso, 1962
Wadso, I.,
Heats of aminolysis and hydrolysis of some N-acetyl compounds and of acetic anhydride,
Acta Chem. Scand., 1962, 16, 471-478. [all data]