Dibenzo[a,c]phenazine
- Formula: C20H12N2
- Molecular weight: 280.3227
- IUPAC Standard InChIKey: KHPYJVQRBJJYSF-UHFFFAOYSA-N
- CAS Registry Number: 215-64-5
- Chemical structure:
View 3d structure (requires JavaScript / HTML 5) - Other names: 9,14-Diazadibenz[a,c]anthracene; 1,2:3,4-Dibenzophenazine; Phenanthrazine; Phenanthro[9,10-b]quinoxaline; Phenanthro-9',10':2,3-quinoxaline; 1,2,3,4-Dibenzphenazine; Dibenz[a,c]phenazine

Lee's RI, non-polar column, temperature ramp

Column type | Active phase | I | Reference | Comment |
---|---|---|---|---|
Capillary | SE-52 | 474.08 | Vassilaros, Kong, et al., 1982 | 20. m/0.30 mm/0.25 μm, H2, 40. C @ 2. min, 4. K/min; Tend: 265. C |

References

Vassilaros, Kong, et al., 1982
Vassilaros, D.L.; Kong, R.C.; Later, D.W.; Lee, M.L.,
Linear retention index system for polycyclic aromatic compounds. Critical evaluation and additional indices,
J. Chromatogr., 1982, 252, 1-20, https://doi.org/10.1016/S0021-9673(01)88394-1
. [all data]